BDBM50033959 1-(2-Butoxy-ethyl)-1-[5-(4,5-diphenyl-1H-imidazol-2-ylsulfanyl)-pentyl]-3-isopropyl-urea::CHEMBL275308
SMILES: CCCCOCCN(CCCCCSc1nc(c([nH]1)-c1ccccc1)-c1ccccc1)C(=O)NC(C)C
InChI Key: InChIKey=BLACHSSXUKUSFC-UHFFFAOYSA-N
Data: 1 IC50
Activity Spreadsheet -- Enzyme Inhibition Constant Data from BindingDB
Found 1 hit for monomerid = 50033959
Trg + Lig
Ki
nM
ΔG°
kcal/mole
IC50
nM
Kd
nM
EC50/IC50
nM
koff
s-1
kon
M-1s-1
pHTemp
°C
Sterol O-acyltransferase, Soat
(Rattus norvegicus)
BDBM50033959
(1-(2-Butoxy-ethyl)-1-[5-(4,5-diphenyl-1H-imidazol-...)
Show SMILES CCCCOCCN(CCCCCSc1nc(c([nH]1)-c1ccccc1)-c1ccccc1)C(=O)NC(C)C
Show InChI InChI=1S/C30H42N4O2S/c1-4-5-21-36-22-20-34(30(35)31-24(2)3)19-13-8-14-23-37-29-32-27(25-15-9-6-10-16-25)28(33-29)26-17-11-7-12-18-26/h6-7,9-12,15-18,24H,4-5,8,13-14,19-23H2,1-3H3,(H,31,35)(H,32,33)
n/an/a 190n/an/an/an/an/an/a
DuPont Merck Research Laboratories
Curated by ChEMBL
Assay Description
Concentration required to inhibit 50% activity of Acyl coenzyme A:cholesterol acyltransferase 1 in vitro using rat liver microsome.
J Med Chem 38: 1067-83 (1995)
BindingDB Entry DOI: 10.7270/Q28S4P0T