BDBM50033987 1-(2-Diethylamino-ethyl)-1-[5-(4,5-diphenyl-1H-imidazol-2-ylsulfanyl)-pentyl]-3-isopropyl-urea::CHEMBL268700
SMILES: CCN(CC)CCN(CCCCCSc1nc(c([nH]1)-c1ccccc1)-c1ccccc1)C(=O)NC(C)C
InChI Key: InChIKey=VOQCKBYOYJSLMN-UHFFFAOYSA-N
Data: 1 IC50
Activity Spreadsheet -- Enzyme Inhibition Constant Data from BindingDB
Found 1 hit for monomerid = 50033987
Trg + Lig
Ki
nM
ΔG°
kcal/mole
IC50
nM
Kd
nM
EC50/IC50
nM
koff
s-1
kon
M-1s-1
pHTemp
°C
Sterol O-acyltransferase, Soat
(Rattus norvegicus)
BDBM50033987
(1-(2-Diethylamino-ethyl)-1-[5-(4,5-diphenyl-1H-imi...)
Show SMILES CCN(CC)CCN(CCCCCSc1nc(c([nH]1)-c1ccccc1)-c1ccccc1)C(=O)NC(C)C
Show InChI InChI=1S/C30H43N5OS/c1-5-34(6-2)21-22-35(30(36)31-24(3)4)20-14-9-15-23-37-29-32-27(25-16-10-7-11-17-25)28(33-29)26-18-12-8-13-19-26/h7-8,10-13,16-19,24H,5-6,9,14-15,20-23H2,1-4H3,(H,31,36)(H,32,33)
n/an/a 660n/an/an/an/an/an/a
DuPont Merck Research Laboratories
Curated by ChEMBL
Assay Description
Concentration required to inhibit 50% activity of Acyl coenzyme A:cholesterol acyltransferase 1 in vitro using rat liver microsome.
J Med Chem 38: 1067-83 (1995)
BindingDB Entry DOI: 10.7270/Q28S4P0T