BDBM50034081 CHEBI:55507::CHEMBL467773
SMILES: CO[C@H]1O[C@H](CO)[C@H](O)[C@H](O)[C@H]1O
InChI Key: InChIKey=HOVAGTYPODGVJG-PZRMXXKTSA-N
Data: 6 Kd
PDB links: 17 PDB IDs match this monomer.
Activity Spreadsheet -- Enzyme Inhibition Constant Data from BindingDB
Found 6 hits for monomerid = 50034081
Trg + Lig
Ki
nM
ΔG°
kcal/mole
IC50
nM
Kd
nM
EC50/IC50
nM
koff
s-1
kon
M-1s-1
pHTemp
°C
PA-I galactophilic lectin
(Pseudomonas aeruginosa (strain ATCC 15692 / PAO1 /...)
BDBM50034081
(CHEBI:55507 | CHEMBL467773)
Show SMILES CO[C@H]1O[C@H](CO)[C@H](O)[C@H](O)[C@H]1O |r|
Show InChI InChI=1S/C7H14O6/c1-12-7-6(11)5(10)4(9)3(2-8)13-7/h3-11H,2H2,1H3/t3-,4+,5+,6-,7+/m1/s1
n/an/an/a 2.00E+4n/an/an/an/an/a
Universit£ Lyon 1& VetAgro Sup
Curated by ChEMBL
Assay Description
Binding affinity to Pseudomonas aeruginosa LecA by ITC method
J Med Chem 57: 10275-89 (2014)
Article DOI: 10.1021/jm500038p
BindingDB Entry DOI: 10.7270/Q2251KSP
Galectin-1
(Homo sapiens (Human))
BDBM50034081
(CHEBI:55507 | CHEMBL467773)
Show SMILES CO[C@H]1O[C@H](CO)[C@H](O)[C@H](O)[C@H]1O |r|
Show InChI InChI=1S/C7H14O6/c1-12-7-6(11)5(10)4(9)3(2-8)13-7/h3-11H,2H2,1H3/t3-,4+,5+,6-,7+/m1/s1
NCI pathway
n/an/an/a>1.00E+7n/an/an/an/an/a
Lund University
Curated by ChEMBL
Assay Description
Antagonist activity against human galectin 1 by fluorescence polarization assay
Bioorg Med Chem Lett 24: 3516-20 (2014)
Article DOI: 10.1016/j.bmcl.2014.05.063
BindingDB Entry DOI: 10.7270/Q2PC341V
Galectin-9
(Homo sapiens (Human))
BDBM50034081
(CHEBI:55507 | CHEMBL467773)
Show SMILES CO[C@H]1O[C@H](CO)[C@H](O)[C@H](O)[C@H]1O |r|
Show InChI InChI=1S/C7H14O6/c1-12-7-6(11)5(10)4(9)3(2-8)13-7/h3-11H,2H2,1H3/t3-,4+,5+,6-,7+/m1/s1
n/an/an/a 2.80E+6n/an/an/an/an/a
Lund University
Curated by ChEMBL
Assay Description
Antagonist activity against human galectin 9 N-terminal domain by fluorescence polarization assay
Bioorg Med Chem Lett 24: 3516-20 (2014)
Article DOI: 10.1016/j.bmcl.2014.05.063
BindingDB Entry DOI: 10.7270/Q2PC341V
Galectin-7
(Homo sapiens (Human))
BDBM50034081
(CHEBI:55507 | CHEMBL467773)
Show SMILES CO[C@H]1O[C@H](CO)[C@H](O)[C@H](O)[C@H]1O |r|
Show InChI InChI=1S/C7H14O6/c1-12-7-6(11)5(10)4(9)3(2-8)13-7/h3-11H,2H2,1H3/t3-,4+,5+,6-,7+/m1/s1
n/an/an/a 1.10E+7n/an/an/an/an/a
Lund University
Curated by ChEMBL
Assay Description
Antagonist activity against human galectin 7 by fluorescence polarization assay
Bioorg Med Chem Lett 24: 3516-20 (2014)
Article DOI: 10.1016/j.bmcl.2014.05.063
BindingDB Entry DOI: 10.7270/Q2PC341V
Galectin-8
(Homo sapiens (Human))
BDBM50034081
(CHEBI:55507 | CHEMBL467773)
Show SMILES CO[C@H]1O[C@H](CO)[C@H](O)[C@H](O)[C@H]1O |r|
Show InChI InChI=1S/C7H14O6/c1-12-7-6(11)5(10)4(9)3(2-8)13-7/h3-11H,2H2,1H3/t3-,4+,5+,6-,7+/m1/s1
n/an/an/a 6.30E+6n/an/an/an/an/a
Lund University
Curated by ChEMBL
Assay Description
Antagonist activity against human galectin 8 N-terminal domain by fluorescence polarization assay
Bioorg Med Chem Lett 24: 3516-20 (2014)
Article DOI: 10.1016/j.bmcl.2014.05.063
BindingDB Entry DOI: 10.7270/Q2PC341V
Galectin-3
(Homo sapiens (Human))
BDBM50034081
(CHEBI:55507 | CHEMBL467773)
Show SMILES CO[C@H]1O[C@H](CO)[C@H](O)[C@H](O)[C@H]1O |r|
Show InChI InChI=1S/C7H14O6/c1-12-7-6(11)5(10)4(9)3(2-8)13-7/h3-11H,2H2,1H3/t3-,4+,5+,6-,7+/m1/s1
Reactome pathway
n/an/an/a 2.70E+6n/an/an/an/an/a
Lund University
Curated by ChEMBL
Assay Description
Antagonist activity against human galectin 3 by fluorescence polarization assay
Bioorg Med Chem Lett 24: 3516-20 (2014)
Article DOI: 10.1016/j.bmcl.2014.05.063
BindingDB Entry DOI: 10.7270/Q2PC341V