BDBM50034550 CHEMBL3359801
SMILES: [H][C@@]12CC[C@@]3(C)[C@@H](C[C@H](OC(C)=O)C(=O)[C@]3([H])[C@@]1(C)C[C@H](OC2=O)c1ccoc1C#Cc1ccccc1C(F)(F)F)C(=O)OC
InChI Key: InChIKey=MVKGFEBPQRRZIZ-DERZLQSWSA-N
Data: 1 EC50
Activity Spreadsheet -- Enzyme Inhibition Constant Data from BindingDB
Found 1 hit for monomerid = 50034550
Trg + Lig
Ki
nM
ΔG°
kcal/mole
IC50
nM
Kd
nM
EC50/IC50
nM
koff
s-1
kon
M-1s-1
pHTemp
°C
Kappa-type opioid receptor
(Homo sapiens (Human))
BDBM50034550
(CHEMBL3359801)
Show SMILES [H][C@@]12CC[C@@]3(C)[C@@H](C[C@H](OC(C)=O)C(=O)[C@]3([H])[C@@]1(C)C[C@H](OC2=O)c1ccoc1C#Cc1ccccc1C(F)(F)F)C(=O)OC |r|
Show InChI InChI=1S/C32H31F3O8/c1-17(36)42-24-15-22(28(38)40-4)30(2)13-11-21-29(39)43-25(16-31(21,3)27(30)26(24)37)19-12-14-41-23(19)10-9-18-7-5-6-8-20(18)32(33,34)35/h5-8,12,14,21-22,24-25,27H,11,13,15-16H2,1-4H3/t21-,22-,24-,25-,27-,30-,31-/m0/s1
Reactome pathway
n/an/an/an/a 430n/an/an/an/a
The University of Kansas
Curated by ChEMBL
Assay Description
Agonist activity at human KOR expressed in CHO cells assessed as inhibition of forskolin-induced cAMP accumulation after 30 mins by luminescence assa...
J Med Chem 57: 10464-75 (2014)
Article DOI: 10.1021/jm501521d
BindingDB Entry DOI: 10.7270/Q2J38V6P