BDBM50035399 CHEMBL3343376
SMILES: COc1cc2c(Oc3ccc(NC(=O)c4nnn(c4C(F)(F)F)-c4ccccc4C(F)(F)F)cc3F)ccnc2cc1OCCCN1CCOCC1
InChI Key: InChIKey=ZVOYCTHEUYIRPQ-UHFFFAOYSA-N
Data: 1 IC50
Activity Spreadsheet -- Enzyme Inhibition Constant Data from BindingDB
Found 1 hit for monomerid = 50035399
Trg + Lig
Ki
nM
ΔG°
kcal/mole
IC50
nM
Kd
nM
EC50/IC50
nM
koff
s-1
kon
M-1s-1
pHTemp
°C
Hepatocyte growth factor receptor
(Homo sapiens (Human))
BDBM50035399
(CHEMBL3343376)
Show SMILES COc1cc2c(Oc3ccc(NC(=O)c4nnn(c4C(F)(F)F)-c4ccccc4C(F)(F)F)cc3F)ccnc2cc1OCCCN1CCOCC1
Show InChI InChI=1S/C34H29F7N6O5/c1-49-28-18-21-24(19-29(28)51-14-4-11-46-12-15-50-16-13-46)42-10-9-26(21)52-27-8-7-20(17-23(27)35)43-32(48)30-31(34(39,40)41)47(45-44-30)25-6-3-2-5-22(25)33(36,37)38/h2-3,5-10,17-19H,4,11-16H2,1H3,(H,43,48)
n/an/a 4n/an/an/an/an/an/a
Key Laboratory of Structure-Based Drug Design and Discovery (Shenyang Pharmaceutical University)
Curated by ChEMBL
Assay Description
Inhibition of c-Met (unknown origin) using poly (Glu, Tyr) 4:1 substrate incubated for 30 mins by HTRF assay
Bioorg Med Chem 22: 6438-52 (2014)
Article DOI: 10.1016/j.bmc.2014.09.037
BindingDB Entry DOI: 10.7270/Q2BG2QM2