BDBM50035401 CHEMBL3343378
SMILES: COc1ccc(cc1)-n1nnc(C(=O)Nc2ccc(Oc3ccnc4cc(OCCCN5CCOCC5)c(OC)cc34)c(F)c2)c1C(F)(F)F
InChI Key: InChIKey=WUTYCVPPFZPUPA-UHFFFAOYSA-N
Data: 1 IC50
Activity Spreadsheet -- Enzyme Inhibition Constant Data from BindingDB
Found 1 hit for monomerid = 50035401
Trg + Lig
Ki
nM
ΔG°
kcal/mole
IC50
nM
Kd
nM
EC50/IC50
nM
koff
s-1
kon
M-1s-1
pHTemp
°C
Hepatocyte growth factor receptor
(Homo sapiens (Human))
BDBM50035401
(CHEMBL3343378)
Show SMILES COc1ccc(cc1)-n1nnc(C(=O)Nc2ccc(Oc3ccnc4cc(OCCCN5CCOCC5)c(OC)cc34)c(F)c2)c1C(F)(F)F
Show InChI InChI=1S/C34H32F4N6O6/c1-46-23-7-5-22(6-8-23)44-32(34(36,37)38)31(41-42-44)33(45)40-21-4-9-28(25(35)18-21)50-27-10-11-39-26-20-30(29(47-2)19-24(26)27)49-15-3-12-43-13-16-48-17-14-43/h4-11,18-20H,3,12-17H2,1-2H3,(H,40,45)
n/an/a 17n/an/an/an/an/an/a
Key Laboratory of Structure-Based Drug Design and Discovery (Shenyang Pharmaceutical University)
Curated by ChEMBL
Assay Description
Inhibition of c-Met (unknown origin) using poly (Glu, Tyr) 4:1 substrate incubated for 30 mins by HTRF assay
Bioorg Med Chem 22: 6438-52 (2014)
Article DOI: 10.1016/j.bmc.2014.09.037
BindingDB Entry DOI: 10.7270/Q2BG2QM2