BDBM50035409 CHEMBL3343383
SMILES: COc1cc2c(Oc3ccc(NC(=O)c4nnn(c4C(F)(F)F)-c4ccc(C)cc4)cc3F)ccnc2cc1OCCCN1CCCCC1
InChI Key: InChIKey=WRHLIOGWJHQBHX-UHFFFAOYSA-N
Data: 1 IC50
Activity Spreadsheet -- Enzyme Inhibition Constant Data from BindingDB
Found 1 hit for monomerid = 50035409
Trg + Lig
Ki
nM
ΔG°
kcal/mole
IC50
nM
Kd
nM
EC50/IC50
nM
koff
s-1
kon
M-1s-1
pHTemp
°C
Hepatocyte growth factor receptor
(Homo sapiens (Human))
BDBM50035409
(CHEMBL3343383)
Show SMILES COc1cc2c(Oc3ccc(NC(=O)c4nnn(c4C(F)(F)F)-c4ccc(C)cc4)cc3F)ccnc2cc1OCCCN1CCCCC1
Show InChI InChI=1S/C35H34F4N6O4/c1-22-7-10-24(11-8-22)45-33(35(37,38)39)32(42-43-45)34(46)41-23-9-12-29(26(36)19-23)49-28-13-14-40-27-21-31(30(47-2)20-25(27)28)48-18-6-17-44-15-4-3-5-16-44/h7-14,19-21H,3-6,15-18H2,1-2H3,(H,41,46)
n/an/a 13n/an/an/an/an/an/a
Key Laboratory of Structure-Based Drug Design and Discovery (Shenyang Pharmaceutical University)
Curated by ChEMBL
Assay Description
Inhibition of c-Met (unknown origin) using poly (Glu, Tyr) 4:1 substrate incubated for 30 mins by HTRF assay
Bioorg Med Chem 22: 6438-52 (2014)
Article DOI: 10.1016/j.bmc.2014.09.037
BindingDB Entry DOI: 10.7270/Q2BG2QM2