BDBM50035799 2-Methylsulfanyl-4-(2-methylsulfanyl-3-nitro-phenyl)-4,7-dihydro-1H-furo[3,4-d]pyrimidin-5-one::CHEMBL22705
SMILES: CSC1=NC2=C(C([N-]1)c1cccc(c1SC)[N+]([O-])=O)C(=[OH+])OC2
InChI Key: InChIKey=PNSOOYOLHFKWJF-UHFFFAOYSA-N
Data: 1 Kd
Activity Spreadsheet -- Enzyme Inhibition Constant Data from BindingDB
Found 1 hit for monomerid = 50035799
Trg + Lig
Ki
nM
ΔG°
kcal/mole
IC50
nM
Kd
nM
EC50/IC50
nM
koff
s-1
kon
M-1s-1
pHTemp
°C
Voltage-dependent L-type calcium channel subunit alpha-1C
(Homo sapiens (Human))
BDBM50035799
(2-Methylsulfanyl-4-(2-methylsulfanyl-3-nitro-pheny...)
Show SMILES CSC1=NC2=C(C([N-]1)c1cccc(c1SC)[N+]([O-])=O)C(=[OH+])OC2 |c:4,t:2|
Show InChI InChI=1S/C14H13N3O4S2/c1-22-12-7(4-3-5-9(12)17(19)20)11-10-8(6-21-13(10)18)15-14(16-11)23-2/h3-5,11H,6H2,1-2H3,(H,15,16,18)
n/an/an/a 1.37E+4n/an/an/an/an/a
Bristol-Myers Squibb Pharmaceutical Research Institute
Curated by ChEMBL
Assay Description
Displacement of [3H]nitrendipine from dihydropyridine receptor of guinea pig myocardial membranes
J Med Chem 38: 119-29 (1995)
BindingDB Entry DOI: 10.7270/Q2F76D7F