BDBM50035906 CHEMBL3361049
SMILES: CC(C)CN(Cc1ccccc1C(F)(F)F)S(=O)(=O)c1ccc(cc1)N1CCN(CC1)C(C)=O
InChI Key: InChIKey=PZYGNMWOOHESPU-UHFFFAOYSA-N
Data: 1 IC50  1 EC50
Activity Spreadsheet -- Enzyme Inhibition Constant Data from BindingDB
Found 2 hits for monomerid = 50035906
Trg + Lig
Ki
nM
ΔG°
kcal/mole
IC50
nM
Kd
nM
EC50/IC50
nM
koff
s-1
kon
M-1s-1
pHTemp
°C
Nuclear receptor ROR-gamma (RORC)
(Homo sapiens (Human))
BDBM50035906
(CHEMBL3361049)
Show SMILES CC(C)CN(Cc1ccccc1C(F)(F)F)S(=O)(=O)c1ccc(cc1)N1CCN(CC1)C(C)=O
Show InChI InChI=1S/C24H30F3N3O3S/c1-18(2)16-30(17-20-6-4-5-7-23(20)24(25,26)27)34(32,33)22-10-8-21(9-11-22)29-14-12-28(13-15-29)19(3)31/h4-11,18H,12-17H2,1-3H3
n/an/a 9.20n/an/an/an/an/an/a
Argenta Discovery Ltd.
Curated by ChEMBL
Assay Description
Displacement of [3H]25-hydroxycholesterol from human RORc-LBD expressed in bacterial expression system after 3 hrs by scintillation counting analysis
Bioorg Med Chem Lett 24: 5769-76 (2014)
Article DOI: 10.1016/j.bmcl.2014.10.037
BindingDB Entry DOI: 10.7270/Q2125V8F
Nuclear receptor ROR-gamma (RORC)
(Homo sapiens (Human))
BDBM50035906
(CHEMBL3361049)
Show SMILES CC(C)CN(Cc1ccccc1C(F)(F)F)S(=O)(=O)c1ccc(cc1)N1CCN(CC1)C(C)=O
Show InChI InChI=1S/C24H30F3N3O3S/c1-18(2)16-30(17-20-6-4-5-7-23(20)24(25,26)27)34(32,33)22-10-8-21(9-11-22)29-14-12-28(13-15-29)19(3)31/h4-11,18H,12-17H2,1-3H3
n/an/an/an/a 85n/an/an/an/a
Argenta Discovery Ltd.
Curated by ChEMBL
Assay Description
Inverse agonist activity at N-terminal 6xHis-tagged human RORc ligand binding domain expressed in bacterial expression system assessed as inhibition ...
Bioorg Med Chem Lett 24: 5769-76 (2014)
Article DOI: 10.1016/j.bmcl.2014.10.037
BindingDB Entry DOI: 10.7270/Q2125V8F