BDBM50036286 (R)-(-)-10-methyl-11-hydroxyaporphine::(R)-6,10-dimethyl-5,6,6a,7-tetrahydro-4H-dibenzo[de,g]quinolin-11-ol::CHEMBL53510
SMILES: CN1CCc2cccc-3c2[C@H]1Cc1ccc(C)c(O)c-31
InChI Key: InChIKey=YGOZTDLAUVOPMF-OAHLLOKOSA-N
Data: 12 KI  1 EC50
Activity Spreadsheet -- Enzyme Inhibition Constant Data from BindingDB
Found 13 hits for monomerid = 50036286
Trg + Lig
Ki
nM
ΔG°
kcal/mole
IC50
nM
Kd
nM
EC50/IC50
nM
koff
s-1
kon
M-1s-1
pHTemp
°C
5-hydroxytryptamine receptor 1A
(Rattus norvegicus (rat))
BDBM50036286
((R)-(-)-10-methyl-11-hydroxyaporphine | (R)-6,10-d...)
Show SMILES CN1CCc2cccc-3c2[C@H]1Cc1ccc(C)c(O)c-31
Show InChI InChI=1S/C18H19NO/c1-11-6-7-13-10-15-16-12(8-9-19(15)2)4-3-5-14(16)17(13)18(11)20/h3-7,15,20H,8-10H2,1-2H3/t15-/m1/s1
0.450n/an/an/an/an/an/an/an/a
Uppsala University
Curated by ChEMBL
Assay Description
In vitro affinity at 5-hydroxytryptamine 1A receptor of rat hippocampus by [3H]-8-OH-DPAT displacement.
J Med Chem 39: 3491-502 (1996)
Article DOI: 10.1021/jm960188q
BindingDB Entry DOI: 10.7270/Q2XW4HXS
5-hydroxytryptamine receptor 1A
(Rattus norvegicus (rat))
BDBM50036286
((R)-(-)-10-methyl-11-hydroxyaporphine | (R)-6,10-d...)
Show SMILES CN1CCc2cccc-3c2[C@H]1Cc1ccc(C)c(O)c-31
Show InChI InChI=1S/C18H19NO/c1-11-6-7-13-10-15-16-12(8-9-19(15)2)4-3-5-14(16)17(13)18(11)20/h3-7,15,20H,8-10H2,1-2H3/t15-/m1/s1
0.450n/an/an/an/an/an/an/an/a
Uppsala University
Curated by ChEMBL
Assay Description
Ability to displace [3H]-8-OH-DPAT binding to rat hippocampal 5-hydroxytryptamine 1A receptor
J Med Chem 38: 647-58 (1995)
BindingDB Entry DOI: 10.7270/Q2HX1BQH
5-hydroxytryptamine receptor 1A
(Rattus norvegicus (rat))
BDBM50036286
((R)-(-)-10-methyl-11-hydroxyaporphine | (R)-6,10-d...)
Show SMILES CN1CCc2cccc-3c2[C@H]1Cc1ccc(C)c(O)c-31
Show InChI InChI=1S/C18H19NO/c1-11-6-7-13-10-15-16-12(8-9-19(15)2)4-3-5-14(16)17(13)18(11)20/h3-7,15,20H,8-10H2,1-2H3/t15-/m1/s1
0.450n/an/an/an/an/an/an/an/a
Chinese Academy of Sciences
Curated by ChEMBL
Assay Description
Displacement of [3H]8-OH-DPAT from rat 5HT1A receptor
J Med Chem 50: 171-81 (2007)
Article DOI: 10.1021/jm060959i
BindingDB Entry DOI: 10.7270/Q22J6CPJ
5-hydroxytryptamine receptor 1A
(Rattus norvegicus (rat))
BDBM50036286
((R)-(-)-10-methyl-11-hydroxyaporphine | (R)-6,10-d...)
Show SMILES CN1CCc2cccc-3c2[C@H]1Cc1ccc(C)c(O)c-31
Show InChI InChI=1S/C18H19NO/c1-11-6-7-13-10-15-16-12(8-9-19(15)2)4-3-5-14(16)17(13)18(11)20/h3-7,15,20H,8-10H2,1-2H3/t15-/m1/s1
216n/an/an/an/an/an/an/an/a
Harvard Medical School
Curated by ChEMBL
Assay Description
Displacement of [3H]8-OH-DPAT from rat 5HT1A receptor
Bioorg Med Chem Lett 17: 4128-30 (2007)
Article DOI: 10.1016/j.bmcl.2007.05.057
BindingDB Entry DOI: 10.7270/Q2ZG6RZ2
D(1A) dopamine receptor
(RAT)
BDBM50036286
((R)-(-)-10-methyl-11-hydroxyaporphine | (R)-6,10-d...)
Show SMILES CN1CCc2cccc-3c2[C@H]1Cc1ccc(C)c(O)c-31
Show InChI InChI=1S/C18H19NO/c1-11-6-7-13-10-15-16-12(8-9-19(15)2)4-3-5-14(16)17(13)18(11)20/h3-7,15,20H,8-10H2,1-2H3/t15-/m1/s1
380n/an/an/an/an/an/an/an/a
Chinese Academy of Sciences
Curated by ChEMBL
Assay Description
Displacement of [3H]SCH-23390 from rat dopamine D1 receptor
J Med Chem 50: 171-81 (2007)
Article DOI: 10.1021/jm060959i
BindingDB Entry DOI: 10.7270/Q22J6CPJ
D(1A) dopamine receptor
(RAT)
BDBM50036286
((R)-(-)-10-methyl-11-hydroxyaporphine | (R)-6,10-d...)
Show SMILES CN1CCc2cccc-3c2[C@H]1Cc1ccc(C)c(O)c-31
Show InChI InChI=1S/C18H19NO/c1-11-6-7-13-10-15-16-12(8-9-19(15)2)4-3-5-14(16)17(13)18(11)20/h3-7,15,20H,8-10H2,1-2H3/t15-/m1/s1
382n/an/an/an/an/an/an/an/a
Uppsala University
Curated by ChEMBL
Assay Description
Ability to displace [3H]-SCH-23,390 binding to rat striatal Dopamine receptor D1
J Med Chem 38: 647-58 (1995)
BindingDB Entry DOI: 10.7270/Q2HX1BQH
D(1A) dopamine receptor
(RAT)
BDBM50036286
((R)-(-)-10-methyl-11-hydroxyaporphine | (R)-6,10-d...)
Show SMILES CN1CCc2cccc-3c2[C@H]1Cc1ccc(C)c(O)c-31
Show InChI InChI=1S/C18H19NO/c1-11-6-7-13-10-15-16-12(8-9-19(15)2)4-3-5-14(16)17(13)18(11)20/h3-7,15,20H,8-10H2,1-2H3/t15-/m1/s1
382n/an/an/an/an/an/an/an/a
Uppsala University
Curated by ChEMBL
Assay Description
In vitro affinity at Dopamine receptor D1 of rat striatum by [3H]-SCH-23,390 displacement.
J Med Chem 39: 3491-502 (1996)
Article DOI: 10.1021/jm960188q
BindingDB Entry DOI: 10.7270/Q2XW4HXS
D(2) dopamine receptor
(Homo sapiens (Human))
BDBM50036286
((R)-(-)-10-methyl-11-hydroxyaporphine | (R)-6,10-d...)
Show SMILES CN1CCc2cccc-3c2[C@H]1Cc1ccc(C)c(O)c-31
Show InChI InChI=1S/C18H19NO/c1-11-6-7-13-10-15-16-12(8-9-19(15)2)4-3-5-14(16)17(13)18(11)20/h3-7,15,20H,8-10H2,1-2H3/t15-/m1/s1
Reactome pathway
1.07E+3n/an/an/an/an/an/an/an/a
Uppsala University
Curated by ChEMBL
Assay Description
In vitro affinity at human cloned Dopamine receptor D2A by [3H]-raclopride displacement.
J Med Chem 39: 3491-502 (1996)
Article DOI: 10.1021/jm960188q
BindingDB Entry DOI: 10.7270/Q2XW4HXS
D(2) dopamine receptor
(Homo sapiens (Human))
BDBM50036286
((R)-(-)-10-methyl-11-hydroxyaporphine | (R)-6,10-d...)
Show SMILES CN1CCc2cccc-3c2[C@H]1Cc1ccc(C)c(O)c-31
Show InChI InChI=1S/C18H19NO/c1-11-6-7-13-10-15-16-12(8-9-19(15)2)4-3-5-14(16)17(13)18(11)20/h3-7,15,20H,8-10H2,1-2H3/t15-/m1/s1
Reactome pathway
1.07E+3n/an/an/an/an/an/an/an/a
Uppsala University
Curated by ChEMBL
Assay Description
Ability to displace [3H]-raclopride binding to cloned human Dopamine receptor D2A
J Med Chem 38: 647-58 (1995)
BindingDB Entry DOI: 10.7270/Q2HX1BQH
D(2) dopamine receptor
(Rattus norvegicus (rat))
BDBM50036286
((R)-(-)-10-methyl-11-hydroxyaporphine | (R)-6,10-d...)
Show SMILES CN1CCc2cccc-3c2[C@H]1Cc1ccc(C)c(O)c-31
Show InChI InChI=1S/C18H19NO/c1-11-6-7-13-10-15-16-12(8-9-19(15)2)4-3-5-14(16)17(13)18(11)20/h3-7,15,20H,8-10H2,1-2H3/t15-/m1/s1
Reactome pathway
1.07E+3n/an/an/an/an/an/an/an/a
Chinese Academy of Sciences
Curated by ChEMBL
Assay Description
Displacement of [3H]raclopride from rat dopamine D2 receptor
J Med Chem 50: 171-81 (2007)
Article DOI: 10.1021/jm060959i
BindingDB Entry DOI: 10.7270/Q22J6CPJ
D(1A) dopamine receptor
(RAT)
BDBM50036286
((R)-(-)-10-methyl-11-hydroxyaporphine | (R)-6,10-d...)
Show SMILES CN1CCc2cccc-3c2[C@H]1Cc1ccc(C)c(O)c-31
Show InChI InChI=1S/C18H19NO/c1-11-6-7-13-10-15-16-12(8-9-19(15)2)4-3-5-14(16)17(13)18(11)20/h3-7,15,20H,8-10H2,1-2H3/t15-/m1/s1
9.65E+3n/an/an/an/an/an/an/an/a
Harvard Medical School
Curated by ChEMBL
Assay Description
Displacement of [3H]SCH23390 from rat dopamine D1 receptor
Bioorg Med Chem Lett 17: 4128-30 (2007)
Article DOI: 10.1016/j.bmcl.2007.05.057
BindingDB Entry DOI: 10.7270/Q2ZG6RZ2
D(2) dopamine receptor
(Rattus norvegicus (rat))
BDBM50036286
((R)-(-)-10-methyl-11-hydroxyaporphine | (R)-6,10-d...)
Show SMILES CN1CCc2cccc-3c2[C@H]1Cc1ccc(C)c(O)c-31
Show InChI InChI=1S/C18H19NO/c1-11-6-7-13-10-15-16-12(8-9-19(15)2)4-3-5-14(16)17(13)18(11)20/h3-7,15,20H,8-10H2,1-2H3/t15-/m1/s1
Reactome pathway
1.15E+4n/an/an/an/an/an/an/an/a
Harvard Medical School
Curated by ChEMBL
Assay Description
Displacement of [3H]nemonapride from rat dopamine D2 receptor
Bioorg Med Chem Lett 17: 4128-30 (2007)
Article DOI: 10.1016/j.bmcl.2007.05.057
BindingDB Entry DOI: 10.7270/Q2ZG6RZ2
5-hydroxytryptamine receptor 1A
(Rattus norvegicus (rat))
BDBM50036286
((R)-(-)-10-methyl-11-hydroxyaporphine | (R)-6,10-d...)
Show SMILES CN1CCc2cccc-3c2[C@H]1Cc1ccc(C)c(O)c-31
Show InChI InChI=1S/C18H19NO/c1-11-6-7-13-10-15-16-12(8-9-19(15)2)4-3-5-14(16)17(13)18(11)20/h3-7,15,20H,8-10H2,1-2H3/t15-/m1/s1
n/an/an/an/a 55n/an/an/an/a
Uppsala University
Curated by ChEMBL
Assay Description
Ability to inhibit 5-HT sensitive,forskolin-stimulated adenylyl cyclase(FSC) activity in rat hippocampal membranes mediated through 5-hydroxytryptami...
J Med Chem 38: 647-58 (1995)
BindingDB Entry DOI: 10.7270/Q2HX1BQH