BDBM50036297 CHEMBL3353060
SMILES: Cn1cc(C(=O)N2CCn3cc(cc3C2)C(=O)NO)c2ccccc12
InChI Key: InChIKey=BJBDGFSJDKBOFD-UHFFFAOYSA-N
Data: 1 IC50
Activity Spreadsheet -- Enzyme Inhibition Constant Data from BindingDB
Found 1 hit for monomerid = 50036297
Trg + Lig
Ki
nM
ΔG°
kcal/mole
IC50
nM
Kd
nM
EC50/IC50
nM
koff
s-1
kon
M-1s-1
pHTemp
°C
Cereblon/Histone deacetylase 6
(Homo sapiens (Human))
BDBM50036297
(CHEMBL3353060)
Show SMILES Cn1cc(C(=O)N2CCn3cc(cc3C2)C(=O)NO)c2ccccc12
Show InChI InChI=1S/C18H18N4O3/c1-20-11-15(14-4-2-3-5-16(14)20)18(24)22-7-6-21-9-12(17(23)19-25)8-13(21)10-22/h2-5,8-9,11,25H,6-7,10H2,1H3,(H,19,23)
NCI pathway
Reactome pathway
n/an/a 190n/an/an/an/an/an/a
TBA
Curated by ChEMBL
Assay Description
Inhibition of recombinant N-GST-tagged HDAC6 (unknown origin) assessed as reduction in deacetylation of Ac-Arg-Gly-Lys(Ac)-AMC substrate by fluoresce...
Bioorg Med Chem Lett 24: 5450-4 (2015)
Article DOI: 10.1016/j.bmcl.2014.10.022
BindingDB Entry DOI: 10.7270/Q2B859QH