BDBM50036301 CHEMBL3353056
SMILES: ONC(=O)c1cc2CN(CCn2c1)C(=O)c1cc2ccccc2s1
InChI Key: InChIKey=PKOFMNJPOQAOMK-UHFFFAOYSA-N
Data: 1 IC50
Activity Spreadsheet -- Enzyme Inhibition Constant Data from BindingDB
Found 1 hit for monomerid = 50036301
Trg + Lig
Ki
nM
ΔG°
kcal/mole
IC50
nM
Kd
nM
EC50/IC50
nM
koff
s-1
kon
M-1s-1
pHTemp
°C
Cereblon/Histone deacetylase 6
(Homo sapiens (Human))
BDBM50036301
(CHEMBL3353056)
Show SMILES ONC(=O)c1cc2CN(CCn2c1)C(=O)c1cc2ccccc2s1
Show InChI InChI=1S/C17H15N3O3S/c21-16(18-23)12-7-13-10-20(6-5-19(13)9-12)17(22)15-8-11-3-1-2-4-14(11)24-15/h1-4,7-9,23H,5-6,10H2,(H,18,21)
NCI pathway
Reactome pathway
n/an/a 39n/an/an/an/an/an/a
TBA
Curated by ChEMBL
Assay Description
Inhibition of recombinant N-GST-tagged HDAC6 (unknown origin) assessed as reduction in deacetylation of Ac-Arg-Gly-Lys(Ac)-AMC substrate by fluoresce...
Bioorg Med Chem Lett 24: 5450-4 (2015)
Article DOI: 10.1016/j.bmcl.2014.10.022
BindingDB Entry DOI: 10.7270/Q2B859QH