BDBM50036535 9-Methyl-7-(2-methyl-allyl)-6,7,8,9-tetrahydro-2H-2,7,9a-triaza-benzo[cd]azulen-1-one::CHEMBL68175
SMILES: CC1CN(CC(C)=C)Cc2cccc3[nH]c(=O)n1c23
InChI Key: InChIKey=CDEPZSKTKQYQEQ-UHFFFAOYSA-N
Data: 1 IC50
Activity Spreadsheet -- Enzyme Inhibition Constant Data from BindingDB
Found 1 hit for monomerid = 50036535
Trg + Lig
Ki
nM
ΔG°
kcal/mole
IC50
nM
Kd
nM
EC50/IC50
nM
koff
s-1
kon
M-1s-1
pHTemp
°C
Human immunodeficiency virus type 1 reverse transcriptase
(Human immunodeficiency virus 1)
BDBM50036535
(9-Methyl-7-(2-methyl-allyl)-6,7,8,9-tetrahydro-2H-...)
Show SMILES CC1CN(CC(C)=C)Cc2cccc3[nH]c(=O)n1c23
Show InChI InChI=1S/C15H19N3O/c1-10(2)7-17-8-11(3)18-14-12(9-17)5-4-6-13(14)16-15(18)19/h4-6,11H,1,7-9H2,2-3H3,(H,16,19)
n/an/a 3.21E+4n/an/an/an/an/an/a
IBM Thomas J. Watson Research Center
Curated by ChEMBL
Assay Description
Inhibitory concentration against HIV-1 replication by interfering with virus reverse transcriptase
J Med Chem 39: 2129-40 (1996)
Article DOI: 10.1021/jm950589q
BindingDB Entry DOI: 10.7270/Q2697471