BDBM50036551 CHEMBL3353606
SMILES: OC(=O)c1ccc(cc1)S(=O)(=O)N(Cc1ccc2occc2c1)c1ncc(cc1Cl)C(F)(F)F
InChI Key: InChIKey=IFVVNDCHVQSSBT-UHFFFAOYSA-N
Data: 1 IC50
Activity Spreadsheet -- Enzyme Inhibition Constant Data from BindingDB
Found 1 hit for monomerid = 50036551
Trg + Lig
Ki
nM
ΔG°
kcal/mole
IC50
nM
Kd
nM
EC50/IC50
nM
koff
s-1
kon
M-1s-1
pHTemp
°C
Transient receptor potential cation channel subfamily M member 8
(Homo sapiens (Human))
BDBM50036551
(CHEMBL3353606)
Show SMILES OC(=O)c1ccc(cc1)S(=O)(=O)N(Cc1ccc2occc2c1)c1ncc(cc1Cl)C(F)(F)F
Show InChI InChI=1S/C22H14ClF3N2O5S/c23-18-10-16(22(24,25)26)11-27-20(18)28(12-13-1-6-19-15(9-13)7-8-33-19)34(31,32)17-4-2-14(3-5-17)21(29)30/h1-11H,12H2,(H,29,30)
n/an/a 15n/an/an/an/an/an/a
RaQualia Pharma Inc.
Curated by ChEMBL
Assay Description
Antagonist activity at human TRPM8 expressed in HEK293 cells assessed as inhibition of menthol induced Ca2+ influx
Bioorg Med Chem Lett 24: 5364-8 (2014)
Article DOI: 10.1016/j.bmcl.2014.10.074
BindingDB Entry DOI: 10.7270/Q2TB18HX