BDBM50036683 (E)-3-[3-(5-Chloro-benzothiazol-2-ylsulfanylmethyl)-4-hydroxy-5-methoxy-phenyl]-2-cyano-acrylamide::3-[3-(5-Chloro-benzothiazol-2-ylsulfanylmethyl)-4-hydroxy-5-methoxy-phenyl]-2-cyano-acrylamide::CHEMBL115519
SMILES: COc1cc(\C=C(/C#N)C(N)=O)cc(CSc2nc3cc(Cl)ccc3s2)c1O
InChI Key: InChIKey=GGFWNDJYHSAUAY-NYYWCZLTSA-N
Data: 6 IC50
Activity Spreadsheet -- Enzyme Inhibition Constant Data from BindingDB
Found 6 hits for monomerid = 50036683
Trg + Lig
Ki
nM
ΔG°
kcal/mole
IC50
nM
Kd
nM
EC50/IC50
nM
koff
s-1
kon
M-1s-1
pHTemp
°C
Epidermal growth factor receptor and ErbB2 (HER1 and HER2)
(Homo sapiens (Human))
BDBM50036683
((E)-3-[3-(5-Chloro-benzothiazol-2-ylsulfanylmethyl...)
Show SMILES COc1cc(\C=C(/C#N)C(N)=O)cc(CSc2nc3cc(Cl)ccc3s2)c1O
Show InChI InChI=1S/C19H14ClN3O3S2/c1-26-15-6-10(4-11(8-21)18(22)25)5-12(17(15)24)9-27-19-23-14-7-13(20)2-3-16(14)28-19/h2-7,24H,9H2,1H3,(H2,22,25)/b11-4+
n/an/a 1.50E+4n/an/an/an/an/an/a
Hebrew University of Jerusalem
Curated by ChEMBL
Assay Description
Inhibition of polyGAT phosphorylation by EGF receptor
J Med Chem 36: 3556-64 (1994)
BindingDB Entry DOI: 10.7270/Q2MP52B9
Epidermal growth factor receptor
(Homo sapiens (Human))
BDBM50036683
((E)-3-[3-(5-Chloro-benzothiazol-2-ylsulfanylmethyl...)
Show SMILES COc1cc(\C=C(/C#N)C(N)=O)cc(CSc2nc3cc(Cl)ccc3s2)c1O
Show InChI InChI=1S/C19H14ClN3O3S2/c1-26-15-6-10(4-11(8-21)18(22)25)5-12(17(15)24)9-27-19-23-14-7-13(20)2-3-16(14)28-19/h2-7,24H,9H2,1H3,(H2,22,25)/b11-4+
n/an/a>8.30E+4n/an/an/an/an/an/a
Hebrew University of Jerusalem
Curated by ChEMBL
Assay Description
Inhibitiory concentration against EGF receptor by autophosphorylation
J Med Chem 36: 3556-64 (1994)
BindingDB Entry DOI: 10.7270/Q2MP52B9
Epidermal growth factor receptor
(Homo sapiens (Human))
BDBM50036683
((E)-3-[3-(5-Chloro-benzothiazol-2-ylsulfanylmethyl...)
Show SMILES COc1cc(\C=C(/C#N)C(N)=O)cc(CSc2nc3cc(Cl)ccc3s2)c1O
Show InChI InChI=1S/C19H14ClN3O3S2/c1-26-15-6-10(4-11(8-21)18(22)25)5-12(17(15)24)9-27-19-23-14-7-13(20)2-3-16(14)28-19/h2-7,24H,9H2,1H3,(H2,22,25)/b11-4+
n/an/a 4.40E+3n/an/an/an/an/an/a
Hebrew University of Jerusalem
Curated by ChEMBL
Assay Description
Inhibitory concentration against EGF receptor by polyGAT phosphorylation
J Med Chem 36: 3556-64 (1994)
BindingDB Entry DOI: 10.7270/Q2MP52B9
Receptor tyrosine-protein kinase erbB-2
(Homo sapiens (Human))
BDBM50036683
((E)-3-[3-(5-Chloro-benzothiazol-2-ylsulfanylmethyl...)
Show SMILES COc1cc(\C=C(/C#N)C(N)=O)cc(CSc2nc3cc(Cl)ccc3s2)c1O
Show InChI InChI=1S/C19H14ClN3O3S2/c1-26-15-6-10(4-11(8-21)18(22)25)5-12(17(15)24)9-27-19-23-14-7-13(20)2-3-16(14)28-19/h2-7,24H,9H2,1H3,(H2,22,25)/b11-4+
n/an/a 1.51E+4n/an/an/an/an/an/a
University of Tennessee Health Sciences Center
Curated by ChEMBL
Assay Description
Inhibitory activity tested against protein kinase HER-2
J Med Chem 46: 4657-68 (2003)
Article DOI: 10.1021/jm030065n
BindingDB Entry DOI: 10.7270/Q2N58NKR
Epidermal growth factor receptor
(Homo sapiens (Human))
BDBM50036683
((E)-3-[3-(5-Chloro-benzothiazol-2-ylsulfanylmethyl...)
Show SMILES COc1cc(\C=C(/C#N)C(N)=O)cc(CSc2nc3cc(Cl)ccc3s2)c1O
Show InChI InChI=1S/C19H14ClN3O3S2/c1-26-15-6-10(4-11(8-21)18(22)25)5-12(17(15)24)9-27-19-23-14-7-13(20)2-3-16(14)28-19/h2-7,24H,9H2,1H3,(H2,22,25)/b11-4+
n/an/a 8.32E+4n/an/an/an/an/an/a
University of Tennessee Health Sciences Center
Curated by ChEMBL
Assay Description
Inhibitory activity against epidermal growth factor receptor (EGFR)
J Med Chem 46: 4657-68 (2003)
Article DOI: 10.1021/jm030065n
BindingDB Entry DOI: 10.7270/Q2N58NKR
Epidermal growth factor receptor
(Homo sapiens (Human))
BDBM50036683
((E)-3-[3-(5-Chloro-benzothiazol-2-ylsulfanylmethyl...)
Show SMILES COc1cc(\C=C(/C#N)C(N)=O)cc(CSc2nc3cc(Cl)ccc3s2)c1O
Show InChI InChI=1S/C19H14ClN3O3S2/c1-26-15-6-10(4-11(8-21)18(22)25)5-12(17(15)24)9-27-19-23-14-7-13(20)2-3-16(14)28-19/h2-7,24H,9H2,1H3,(H2,22,25)/b11-4+
n/an/a 4.50E+3n/an/an/an/an/an/a
Hebrew University of Jerusalem
Curated by ChEMBL
Assay Description
Inhibitiory concentration against EGF receptor by autophosphorylation
J Med Chem 36: 3556-64 (1994)
BindingDB Entry DOI: 10.7270/Q2MP52B9