BDBM50036792 CHEMBL3354833
SMILES: CCc1cc(=O)nc(Nc2ccc(Cl)c(c2O)S(=O)(=O)C(C)C)[nH]1
InChI Key: InChIKey=ULDVDULVYHEREY-UHFFFAOYSA-N
Data: 1 IC50
Activity Spreadsheet -- Enzyme Inhibition Constant Data from BindingDB
Found 1 hit for monomerid = 50036792
Trg + Lig
Ki
nM
ΔG°
kcal/mole
IC50
nM
Kd
nM
EC50/IC50
nM
koff
s-1
kon
M-1s-1
pHTemp
°C
C-X-C chemokine receptor type 2
(Homo sapiens (Human))
BDBM50036792
(CHEMBL3354833)
Show SMILES CCc1cc(=O)nc(Nc2ccc(Cl)c(c2O)S(=O)(=O)C(C)C)[nH]1
Show InChI InChI=1S/C15H18ClN3O4S/c1-4-9-7-12(20)19-15(17-9)18-11-6-5-10(16)14(13(11)21)24(22,23)8(2)3/h5-8,21H,4H2,1-3H3,(H2,17,18,19,20)
Reactome pathway
n/an/a 251n/an/an/an/an/an/a
GlaxoSmithKline
Curated by ChEMBL
Assay Description
Antagonist activity at CXCR2 (unknown origin) by beta-arrestin assay
Bioorg Med Chem Lett 24: 5493-6 (2015)
Article DOI: 10.1016/j.bmcl.2014.10.003
BindingDB Entry DOI: 10.7270/Q21V5GKV