BDBM50036803 CHEMBL3355239
SMILES: CC(C)S(=O)(=O)c1c(Cl)ccc(Nc2nc(=O)cc([nH]2)C2CCCC2C)c1O
InChI Key: InChIKey=OJYVDVJJTVJQMP-UHFFFAOYSA-N
Data: 1 IC50
Activity Spreadsheet -- Enzyme Inhibition Constant Data from BindingDB
Found 1 hit for monomerid = 50036803
Trg + Lig
Ki
nM
ΔG°
kcal/mole
IC50
nM
Kd
nM
EC50/IC50
nM
koff
s-1
kon
M-1s-1
pHTemp
°C
C-X-C chemokine receptor type 2
(Homo sapiens (Human))
BDBM50036803
(CHEMBL3355239)
Show SMILES CC(C)S(=O)(=O)c1c(Cl)ccc(Nc2nc(=O)cc([nH]2)C2CCCC2C)c1O
Show InChI InChI=1S/C19H24ClN3O4S/c1-10(2)28(26,27)18-13(20)7-8-14(17(18)25)21-19-22-15(9-16(24)23-19)12-6-4-5-11(12)3/h7-12,25H,4-6H2,1-3H3,(H2,21,22,23,24)
Reactome pathway
n/an/a 32n/an/an/an/an/an/a
GlaxoSmithKline
Curated by ChEMBL
Assay Description
Antagonist activity at CXCR2 (unknown origin) by beta-arrestin assay
Bioorg Med Chem Lett 24: 5493-6 (2015)
Article DOI: 10.1016/j.bmcl.2014.10.003
BindingDB Entry DOI: 10.7270/Q21V5GKV