null
SMILES: CCCC[C@H](O[C@@H](Cc1ccccc1)C(=O)N1CCC(CC1)OCOC)C(=O)N[C@@H](CC1CCCCC1)[C@@H](O)C[C@@H](C(C)C)C(=O)NCCNc1noc(N)n1
InChI Key: InChIKey=PYCXMQLSJUCSHT-XYPUQJIVSA-N
Activity Spreadsheet -- Enzyme Inhibition Constant Data from BindingDB
Found 1 hit for monomerid = 50036986
Trg + Lig
Ki
nM
ΔG°
kcal/mole
IC50
nM
Kd
nM
EC50/IC50
nM
koff
s-1
kon
M-1s-1
pHTemp
°C
Renin
(Homo sapiens (Human))
BDBM50036986
((2S,4S,5S)-5-{(S)-2-[(S)-1-Benzyl-2-(4-methoxymeth...)
Show SMILES CCCC[C@H](O[C@@H](Cc1ccccc1)C(=O)N1CCC(CC1)OCOC)C(=O)N[C@@H](CC1CCCCC1)[C@@H](O)C[C@@H](C(C)C)C(=O)NCCNc1noc(N)n1
Show InChI InChI=1S/C41H67N7O8/c1-5-6-17-35(55-36(25-30-15-11-8-12-16-30)39(52)48-22-18-31(19-23-48)54-27-53-4)38(51)45-33(24-29-13-9-7-10-14-29)34(49)26-32(28(2)3)37(50)43-20-21-44-41-46-40(42)56-47-41/h8,11-12,15-16,28-29,31-36,49H,5-7,9-10,13-14,17-27H2,1-4H3,(H,43,50)(H,45,51)(H3,42,44,46,47)/t32-,33-,34-,35-,36-/m0/s1
Reactome pathway
n/an/a 3.10n/an/an/an/a7.4n/a
Abbott Laboratories
Curated by ChEMBL
Assay Description
Tested in vitro for its ability to inhibit the human plasma renin at pH of 7.4
J Med Chem 37: 2991-3007 (1994)
BindingDB Entry DOI: 10.7270/Q26H4GFS