BDBM50037007 (2S,4S,5S)-5-{(S)-2-[(S)-1-Benzyl-2-(4-methoxymethoxy-piperidin-1-yl)-2-oxo-ethoxy]-hexanoylamino}-6-cyclohexyl-4-hydroxy-2-isopropyl-hexanoic acid (3-ureido-propyl)-amide::CHEMBL245189
SMILES: CCCC[C@H](O[C@@H](Cc1ccccc1)C(=O)N1CCC(CC1)OCOC)C(=O)N[C@@H](CC1CCCCC1)[C@@H](O)C[C@@H](C(C)C)C(=O)NCCCNC(N)=O
InChI Key: InChIKey=OTOQNEUJTXSRLA-LTLCPEALSA-N
Data: 1 IC50
Activity Spreadsheet -- Enzyme Inhibition Constant Data from BindingDB
Found 1 hit for monomerid = 50037007
Trg + Lig
Ki
nM
ΔG°
kcal/mole
IC50
nM
Kd
nM
EC50/IC50
nM
koff
s-1
kon
M-1s-1
pHTemp
°C
Renin
(Homo sapiens (Human))
BDBM50037007
((2S,4S,5S)-5-{(S)-2-[(S)-1-Benzyl-2-(4-methoxymeth...)
Show SMILES CCCC[C@H](O[C@@H](Cc1ccccc1)C(=O)N1CCC(CC1)OCOC)C(=O)N[C@@H](CC1CCCCC1)[C@@H](O)C[C@@H](C(C)C)C(=O)NCCCNC(N)=O
Show InChI InChI=1S/C41H69N5O8/c1-5-6-18-36(54-37(26-31-16-11-8-12-17-31)40(50)46-23-19-32(20-24-46)53-28-52-4)39(49)45-34(25-30-14-9-7-10-15-30)35(47)27-33(29(2)3)38(48)43-21-13-22-44-41(42)51/h8,11-12,16-17,29-30,32-37,47H,5-7,9-10,13-15,18-28H2,1-4H3,(H,43,48)(H,45,49)(H3,42,44,51)/t33-,34-,35-,36-,37-/m0/s1
Reactome pathway
n/an/a 2n/an/an/an/a7.4n/a
Abbott Laboratories
Curated by ChEMBL
Assay Description
Tested in vitro for its ability to inhibit the human plasma renin at pH of 7.4
J Med Chem 37: 2991-3007 (1994)
BindingDB Entry DOI: 10.7270/Q26H4GFS