BDBM50037314 (R)-2-((R)-4-Carboxy-4-{4-[(2-methyl-4-oxo-3,4-dihydro-quinazolin-6-ylmethyl)-prop-2-ynyl-amino]-benzoylamino}-butyrylamino)-succinic acid::CHEMBL113266
SMILES: Cc1nc2ccc(CN(CC#C)c3ccc(cc3)C(=O)N[C@H](CCC(=O)N[C@H](CC(O)=O)C(O)=O)C(O)=O)cc2c(=O)[nH]1
InChI Key: InChIKey=IGFXQDUXZQXEOE-DHIUTWEWSA-N
Data: 1 IC50
Activity Spreadsheet -- Enzyme Inhibition Constant Data from BindingDB
Found 1 hit for monomerid = 50037314
Trg + Lig
Ki
nM
ΔG°
kcal/mole
IC50
nM
Kd
nM
EC50/IC50
nM
koff
s-1
kon
M-1s-1
pHTemp
°C
Thymidylate synthase
(Mus musculus)
BDBM50037314
((R)-2-((R)-4-Carboxy-4-{4-[(2-methyl-4-oxo-3,4-dih...)
Show SMILES Cc1nc2ccc(CN(CC#C)c3ccc(cc3)C(=O)N[C@H](CCC(=O)N[C@H](CC(O)=O)C(O)=O)C(O)=O)cc2c(=O)[nH]1
Show InChI InChI=1S/C29H29N5O9/c1-3-12-34(15-17-4-9-21-20(13-17)27(39)31-16(2)30-21)19-7-5-18(6-8-19)26(38)33-22(28(40)41)10-11-24(35)32-23(29(42)43)14-25(36)37/h1,4-9,13,22-23H,10-12,14-15H2,2H3,(H,32,35)(H,33,38)(H,36,37)(H,40,41)(H,42,43)(H,30,31,39)/t22-,23-/m1/s1
Reactome pathway
n/an/a 10n/an/an/an/an/an/a
Institute of Cancer Research
Curated by ChEMBL
Assay Description
Tested for inhibition against thymidylate synthase(TS) which is partially purified from L1210 mouse leukemia cells
J Med Chem 37: 3294-302 (1994)
BindingDB Entry DOI: 10.7270/Q2QV3N50