BDBM50037642 1-[5-(4,5-Diphenyl-1H-imidazol-2-ylsulfanyl)-pentyl]-1-heptyl-3-phenyl-urea::CHEMBL119729
SMILES: CCCCCCCN(CCCCCSc1nc(c([nH]1)-c1ccccc1)-c1ccccc1)C(=O)Nc1ccccc1
InChI Key: InChIKey=HWIYGZLOTZTQMB-UHFFFAOYSA-N
Data: 1 IC50
Activity Spreadsheet -- Enzyme Inhibition Constant Data from BindingDB
Found 1 hit for monomerid = 50037642
Trg + Lig
Ki
nM
ΔG°
kcal/mole
IC50
nM
Kd
nM
EC50/IC50
nM
koff
s-1
kon
M-1s-1
pHTemp
°C
Sterol O-acyltransferase, Soat
(Rattus norvegicus)
BDBM50037642
(1-[5-(4,5-Diphenyl-1H-imidazol-2-ylsulfanyl)-penty...)
Show SMILES CCCCCCCN(CCCCCSc1nc(c([nH]1)-c1ccccc1)-c1ccccc1)C(=O)Nc1ccccc1
Show InChI InChI=1S/C34H42N4OS/c1-2-3-4-5-16-25-38(34(39)35-30-23-14-8-15-24-30)26-17-9-18-27-40-33-36-31(28-19-10-6-11-20-28)32(37-33)29-21-12-7-13-22-29/h6-8,10-15,19-24H,2-5,9,16-18,25-27H2,1H3,(H,35,39)(H,36,37)
n/an/a 23n/an/an/an/an/an/a
DuPont Merck Research Laboratories
Curated by ChEMBL
Assay Description
In vitro inhibition of Acyl coenzyme A:cholesterol acyltransferase in rat hepatic microsomes
J Med Chem 37: 3511-22 (1994)
BindingDB Entry DOI: 10.7270/Q2MK6BXK