BDBM50037833 (3S,4aS,8aS)-2-[(S)-3-({(2R,4S)-2-[(4-Dimethylamino-benzylcarbamoyl)-((S)-phenylacetylamino)-methyl]-5,5-dimethyl-thiazolidine-4-carbonyl}-amino)-2-hydroxy-propyl]-decahydro-isoquinoline-3-carboxylic acid tert-butylamide::CHEMBL333982
SMILES: CN(C)c1ccc(CNC(=O)C(NC(=O)Cc2ccccc2)[C@@H]2N[C@@H](C(=O)NC[C@H](O)CN3C[C@H]4CCCC[C@H]4C[C@H]3C(=O)NC(C)(C)C)C(C)(C)S2)cc1
InChI Key: InChIKey=WIXUDGGEVYMHOW-VYWPSWJASA-N
Data: 1 IC50
Activity Spreadsheet -- Enzyme Inhibition Constant Data from BindingDB
Found 1 hit for monomerid = 50037833
Trg + Lig
Ki
nM
ΔG°
kcal/mole
IC50
nM
Kd
nM
EC50/IC50
nM
koff
s-1
kon
M-1s-1
pHTemp
°C
Human immunodeficiency virus type 1 protease
(Human immunodeficiency virus type 1)
BDBM50037833
((3S,4aS,8aS)-2-[(S)-3-({(2R,4S)-2-[(4-Dimethylamin...)
Show SMILES CN(C)c1ccc(CNC(=O)C(NC(=O)Cc2ccccc2)[C@@H]2N[C@@H](C(=O)NC[C@H](O)CN3C[C@H]4CCCC[C@H]4C[C@H]3C(=O)NC(C)(C)C)C(C)(C)S2)cc1
Show InChI InChI=1S/C42H63N7O5S/c1-41(2,3)47-37(52)33-22-29-15-11-12-16-30(29)25-49(33)26-32(50)24-44-39(54)36-42(4,5)55-40(46-36)35(45-34(51)21-27-13-9-8-10-14-27)38(53)43-23-28-17-19-31(20-18-28)48(6)7/h8-10,13-14,17-20,29-30,32-33,35-36,40,46,50H,11-12,15-16,21-26H2,1-7H3,(H,43,53)(H,44,54)(H,45,51)(H,47,52)/t29-,30+,32-,33-,35?,36-,40+/m0/s1
n/an/a 26n/an/an/an/an/an/a
Glaxo Research and Development Limited
Curated by ChEMBL
Assay Description
In vitro inhibitory activity against HIV proteinase
J Med Chem 37: 3707-16 (1994)
BindingDB Entry DOI: 10.7270/Q2V40T88