BDBM50037834 (3S,4aS,8aS)-2-[(R)-3-({(2R,4S)-2-[(Cyclohexylmethyl-carbamoyl)-((S)-phenylacetylamino)-methyl]-5,5-dimethyl-thiazolidine-4-carbonyl}-amino)-2-hydroxy-propyl]-decahydro-isoquinoline-3-carboxylic acid tert-butylamide::CHEMBL125720
SMILES: CC(C)(C)NC(=O)[C@@H]1C[C@@H]2CCCC[C@@H]2CN1C[C@H](O)CNC(=O)[C@@H]1N[C@H](SC1(C)C)C(NC(=O)Cc1ccccc1)C(=O)NCC1CCCCC1
InChI Key: InChIKey=JDQVFOBPOUGCFL-BHOJLHHWSA-N
Data: 1 IC50
Activity Spreadsheet -- Enzyme Inhibition Constant Data from BindingDB
Found 1 hit for monomerid = 50037834
Trg + Lig
Ki
nM
ΔG°
kcal/mole
IC50
nM
Kd
nM
EC50/IC50
nM
koff
s-1
kon
M-1s-1
pHTemp
°C
Human immunodeficiency virus type 1 protease
(Human immunodeficiency virus type 1)
BDBM50037834
((3S,4aS,8aS)-2-[(R)-3-({(2R,4S)-2-[(Cyclohexylmeth...)
Show SMILES CC(C)(C)NC(=O)[C@@H]1C[C@@H]2CCCC[C@@H]2CN1C[C@H](O)CNC(=O)[C@@H]1N[C@H](SC1(C)C)C(NC(=O)Cc1ccccc1)C(=O)NCC1CCCCC1
Show InChI InChI=1S/C40H64N6O5S/c1-39(2,3)45-35(49)31-21-28-18-12-13-19-29(28)24-46(31)25-30(47)23-42-37(51)34-40(4,5)52-38(44-34)33(36(50)41-22-27-16-10-7-11-17-27)43-32(48)20-26-14-8-6-9-15-26/h6,8-9,14-15,27-31,33-34,38,44,47H,7,10-13,16-25H2,1-5H3,(H,41,50)(H,42,51)(H,43,48)(H,45,49)/t28-,29+,30+,31-,33?,34-,38+/m0/s1
n/an/a 300n/an/an/an/an/an/a
Glaxo Research and Development Limited
Curated by ChEMBL
Assay Description
In vitro inhibitory activity against HIV proteinase
J Med Chem 37: 3707-16 (1994)
BindingDB Entry DOI: 10.7270/Q2V40T88