BDBM50037851 CHEMBL125863::N-tert-Butyl-2-{(3R,5R)-3-[3-(3-methoxy-phenyl)-ureido]-2-oxo-5-phenyl-2,3,4,5-tetrahydro-benzo[b]azepin-1-yl}-acetamide
SMILES: COc1cccc(NC(=O)N[C@@H]2C[C@H](c3ccccc3)c3ccccc3N(CC(=O)NC(C)(C)C)C2=O)c1
InChI Key: InChIKey=XNUGDRMOEPOBFR-JWQCQUIFSA-N
Data: 2 IC50
Activity Spreadsheet -- Enzyme Inhibition Constant Data from BindingDB
Found 2 hits for monomerid = 50037851
Trg + Lig
Ki
nM
ΔG°
kcal/mole
IC50
nM
Kd
nM
EC50/IC50
nM
koff
s-1
kon
M-1s-1
pHTemp
°C
Gastrin/cholecystokinin type B receptor
(Homo sapiens (Human))
BDBM50037851
(CHEMBL125863 | N-tert-Butyl-2-{(3R,5R)-3-[3-(3-met...)
Show SMILES COc1cccc(NC(=O)N[C@@H]2C[C@H](c3ccccc3)c3ccccc3N(CC(=O)NC(C)(C)C)C2=O)c1
Show InChI InChI=1S/C30H34N4O4/c1-30(2,3)33-27(35)19-34-26-16-9-8-15-23(26)24(20-11-6-5-7-12-20)18-25(28(34)36)32-29(37)31-21-13-10-14-22(17-21)38-4/h5-17,24-25H,18-19H2,1-4H3,(H,33,35)(H2,31,32,37)/t24-,25-/m1/s1
Reactome pathway
n/an/a 30.4n/an/an/an/an/an/a
Pfizer Inc.
Curated by ChEMBL
Assay Description
In vitro affinity to the cholecystokinin type B receptor in guinea pig cortex assayed using [125I]-BH-CCK-8 as radioligand
J Med Chem 37: 3789-811 (1994)
BindingDB Entry DOI: 10.7270/Q2KK99TN
Cholecystokinin receptor type A
(Cavia porcellus)
BDBM50037851
(CHEMBL125863 | N-tert-Butyl-2-{(3R,5R)-3-[3-(3-met...)
Show SMILES COc1cccc(NC(=O)N[C@@H]2C[C@H](c3ccccc3)c3ccccc3N(CC(=O)NC(C)(C)C)C2=O)c1
Show InChI InChI=1S/C30H34N4O4/c1-30(2,3)33-27(35)19-34-26-16-9-8-15-23(26)24(20-11-6-5-7-12-20)18-25(28(34)36)32-29(37)31-21-13-10-14-22(17-21)38-4/h5-17,24-25H,18-19H2,1-4H3,(H,33,35)(H2,31,32,37)/t24-,25-/m1/s1
Reactome pathway
n/an/a 166n/an/an/an/an/an/a
Pfizer Inc.
Curated by ChEMBL
Assay Description
In vitro binding affinity for the cholecystokinin type A receptor in guinea pig pancreas assayed using [125I]-BH-CCK-8 as radioligand
J Med Chem 37: 3789-811 (1994)
BindingDB Entry DOI: 10.7270/Q2KK99TN