BDBM50037864 CHEMBL124340::N-tert-Butyl-2-{(3R,5R)-3-[3-(3-chloro-phenyl)-ureido]-9-methyl-2-oxo-5-phenyl-2,3,4,5-tetrahydro-benzo[b]azepin-1-yl}-acetamide
SMILES: Cc1cccc2[C@H](C[C@@H](NC(=O)Nc3cccc(Cl)c3)C(=O)N(CC(=O)NC(C)(C)C)c12)c1ccccc1
InChI Key: InChIKey=JHFTVYNYYKDISE-JWQCQUIFSA-N
Data: 2 IC50
Activity Spreadsheet -- Enzyme Inhibition Constant Data from BindingDB
Found 2 hits for monomerid = 50037864
Trg + Lig
Ki
nM
ΔG°
kcal/mole
IC50
nM
Kd
nM
EC50/IC50
nM
koff
s-1
kon
M-1s-1
pHTemp
°C
Gastrin/cholecystokinin type B receptor
(Homo sapiens (Human))
BDBM50037864
(CHEMBL124340 | N-tert-Butyl-2-{(3R,5R)-3-[3-(3-chl...)
Show SMILES Cc1cccc2[C@H](C[C@@H](NC(=O)Nc3cccc(Cl)c3)C(=O)N(CC(=O)NC(C)(C)C)c12)c1ccccc1
Show InChI InChI=1S/C30H33ClN4O3/c1-19-10-8-15-23-24(20-11-6-5-7-12-20)17-25(33-29(38)32-22-14-9-13-21(31)16-22)28(37)35(27(19)23)18-26(36)34-30(2,3)4/h5-16,24-25H,17-18H2,1-4H3,(H,34,36)(H2,32,33,38)/t24-,25-/m1/s1
Reactome pathway
n/an/a 2.20n/an/an/an/an/an/a
Pfizer Inc.
Curated by ChEMBL
Assay Description
In vitro affinity to the cholecystokinin type B receptor in guinea pig cortex assayed using [125I]-BH-CCK-8 as radioligand
J Med Chem 37: 3789-811 (1994)
BindingDB Entry DOI: 10.7270/Q2KK99TN
Cholecystokinin receptor type A
(Cavia porcellus)
BDBM50037864
(CHEMBL124340 | N-tert-Butyl-2-{(3R,5R)-3-[3-(3-chl...)
Show SMILES Cc1cccc2[C@H](C[C@@H](NC(=O)Nc3cccc(Cl)c3)C(=O)N(CC(=O)NC(C)(C)C)c12)c1ccccc1
Show InChI InChI=1S/C30H33ClN4O3/c1-19-10-8-15-23-24(20-11-6-5-7-12-20)17-25(33-29(38)32-22-14-9-13-21(31)16-22)28(37)35(27(19)23)18-26(36)34-30(2,3)4/h5-16,24-25H,17-18H2,1-4H3,(H,34,36)(H2,32,33,38)/t24-,25-/m1/s1
Reactome pathway
n/an/a 77n/an/an/an/an/an/a
Pfizer Inc.
Curated by ChEMBL
Assay Description
In vitro binding affinity for the cholecystokinin type A receptor in guinea pig pancreas assayed using [125I]-BH-CCK-8 as radioligand
J Med Chem 37: 3789-811 (1994)
BindingDB Entry DOI: 10.7270/Q2KK99TN