BDBM50038425 (S)-3-((S)-2-{(R)-2-[(2S,3S)-2-Amino-3-(4-hydroxy-2,6-dimethyl-phenyl)-butyrylamino]-propionylamino}-3-phenyl-propionylamino)-N-{(S)-1-[(S)-1-(carbamoylmethyl-carbamoyl)-2-methyl-propylcarbamoyl]-2-methyl-propyl}-succinamic acid::CHEMBL49507
SMILES: CC(C)[C@H](NC(=O)[C@@H](NC(=O)[C@H](CC(O)=O)NC(=O)[C@H](Cc1ccccc1)NC(=O)[C@@H](C)NC(=O)[C@@H](N)[C@@H](C)c1c(C)cc(O)cc1C)C(C)C)C(=O)NCC(N)=O
InChI Key: InChIKey=BRUXMHJPZAHHIV-WRWFCRRXSA-N
Data: 2 IC50  2 EC50
Activity Spreadsheet -- Enzyme Inhibition Constant Data from BindingDB
Found 4 hits for monomerid = 50038425
Trg + Lig
Ki
nM
ΔG°
kcal/mole
IC50
nM
Kd
nM
EC50/IC50
nM
koff
s-1
kon
M-1s-1
pHTemp
°C
Mu-type opioid receptor
(GUINEA PIG)
BDBM50038425
((S)-3-((S)-2-{(R)-2-[(2S,3S)-2-Amino-3-(4-hydroxy-...)
Show SMILES CC(C)[C@H](NC(=O)[C@@H](NC(=O)[C@H](CC(O)=O)NC(=O)[C@H](Cc1ccccc1)NC(=O)[C@@H](C)NC(=O)[C@@H](N)[C@@H](C)c1c(C)cc(O)cc1C)C(C)C)C(=O)NCC(N)=O
Show InChI InChI=1S/C40H58N8O10/c1-19(2)33(39(57)43-18-29(41)50)48-40(58)34(20(3)4)47-37(55)28(17-30(51)52)46-36(54)27(16-25-12-10-9-11-13-25)45-35(53)24(8)44-38(56)32(42)23(7)31-21(5)14-26(49)15-22(31)6/h9-15,19-20,23-24,27-28,32-34,49H,16-18,42H2,1-8H3,(H2,41,50)(H,43,57)(H,44,56)(H,45,53)(H,46,54)(H,47,55)(H,48,58)(H,51,52)/t23-,24+,27-,28-,32-,33-,34-/m0/s1
n/an/an/an/a 3.84E+3n/an/an/an/a
University of Arizona
Curated by ChEMBL
Assay Description
Effective concentration was measured towards mu opioid receptor using guinea pig ileum (GPI,mu) bioassay in vitro
J Med Chem 37: 1746-57 (1994)
BindingDB Entry DOI: 10.7270/Q2N58N1K
Delta-type opioid receptor
(MOUSE)
BDBM50038425
((S)-3-((S)-2-{(R)-2-[(2S,3S)-2-Amino-3-(4-hydroxy-...)
Show SMILES CC(C)[C@H](NC(=O)[C@@H](NC(=O)[C@H](CC(O)=O)NC(=O)[C@H](Cc1ccccc1)NC(=O)[C@@H](C)NC(=O)[C@@H](N)[C@@H](C)c1c(C)cc(O)cc1C)C(C)C)C(=O)NCC(N)=O
Show InChI InChI=1S/C40H58N8O10/c1-19(2)33(39(57)43-18-29(41)50)48-40(58)34(20(3)4)47-37(55)28(17-30(51)52)46-36(54)27(16-25-12-10-9-11-13-25)45-35(53)24(8)44-38(56)32(42)23(7)31-21(5)14-26(49)15-22(31)6/h9-15,19-20,23-24,27-28,32-34,49H,16-18,42H2,1-8H3,(H2,41,50)(H,43,57)(H,44,56)(H,45,53)(H,46,54)(H,47,55)(H,48,58)(H,51,52)/t23-,24+,27-,28-,32-,33-,34-/m0/s1
Reactome pathway
n/an/an/an/a 0.660n/an/an/an/a
University of Arizona
Curated by ChEMBL
Assay Description
Effective concentration was measured towards delta opioid receptor using mouse vas deferens(MVD, delta) bioassay in vitro
J Med Chem 37: 1746-57 (1994)
BindingDB Entry DOI: 10.7270/Q2N58N1K
Delta-type opioid receptor
(MOUSE)
BDBM50038425
((S)-3-((S)-2-{(R)-2-[(2S,3S)-2-Amino-3-(4-hydroxy-...)
Show SMILES CC(C)[C@H](NC(=O)[C@@H](NC(=O)[C@H](CC(O)=O)NC(=O)[C@H](Cc1ccccc1)NC(=O)[C@@H](C)NC(=O)[C@@H](N)[C@@H](C)c1c(C)cc(O)cc1C)C(C)C)C(=O)NCC(N)=O
Show InChI InChI=1S/C40H58N8O10/c1-19(2)33(39(57)43-18-29(41)50)48-40(58)34(20(3)4)47-37(55)28(17-30(51)52)46-36(54)27(16-25-12-10-9-11-13-25)45-35(53)24(8)44-38(56)32(42)23(7)31-21(5)14-26(49)15-22(31)6/h9-15,19-20,23-24,27-28,32-34,49H,16-18,42H2,1-8H3,(H2,41,50)(H,43,57)(H,44,56)(H,45,53)(H,46,54)(H,47,55)(H,48,58)(H,51,52)/t23-,24+,27-,28-,32-,33-,34-/m0/s1
Reactome pathway
n/an/a 1.71E+4n/an/an/an/an/an/a
University of Arizona
Curated by ChEMBL
Assay Description
Binding affinity opioid receptor
J Med Chem 37: 1746-57 (1994)
BindingDB Entry DOI: 10.7270/Q2N58N1K
Delta-type opioid receptor
(MOUSE)
BDBM50038425
((S)-3-((S)-2-{(R)-2-[(2S,3S)-2-Amino-3-(4-hydroxy-...)
Show SMILES CC(C)[C@H](NC(=O)[C@@H](NC(=O)[C@H](CC(O)=O)NC(=O)[C@H](Cc1ccccc1)NC(=O)[C@@H](C)NC(=O)[C@@H](N)[C@@H](C)c1c(C)cc(O)cc1C)C(C)C)C(=O)NCC(N)=O
Show InChI InChI=1S/C40H58N8O10/c1-19(2)33(39(57)43-18-29(41)50)48-40(58)34(20(3)4)47-37(55)28(17-30(51)52)46-36(54)27(16-25-12-10-9-11-13-25)45-35(53)24(8)44-38(56)32(42)23(7)31-21(5)14-26(49)15-22(31)6/h9-15,19-20,23-24,27-28,32-34,49H,16-18,42H2,1-8H3,(H2,41,50)(H,43,57)(H,44,56)(H,45,53)(H,46,54)(H,47,55)(H,48,58)(H,51,52)/t23-,24+,27-,28-,32-,33-,34-/m0/s1
Reactome pathway
n/an/a 3n/an/an/an/an/an/a
University of Arizona
Curated by ChEMBL
Assay Description
Binding affinity opioid receptor
J Med Chem 37: 1746-57 (1994)
BindingDB Entry DOI: 10.7270/Q2N58N1K