BDBM50038732 CHEMBL413549::Hexyl-carbamic acid 9-ethyl-9-aza-tricyclo[6.3.1.0*2,7*]dodeca-2,4,6-trien-4-yl ester
SMILES: CCCCCCNC(=O)Oc1ccc2C3CC(CCN3CC)c2c1
InChI Key: InChIKey=KVLGOUWOJOAJTC-UHFFFAOYSA-N
Data: 2 IC50
Activity Spreadsheet -- Enzyme Inhibition Constant Data from BindingDB
Found 2 hits for monomerid = 50038732
Trg + Lig
Ki
nM
ΔG°
kcal/mole
IC50
nM
Kd
nM
EC50/IC50
nM
koff
s-1
kon
M-1s-1
pHTemp
°C
Acetylcholinesterase
(Homo sapiens (Human))
BDBM50038732
(CHEMBL413549 | Hexyl-carbamic acid 9-ethyl-9-aza-t...)
Show SMILES CCCCCCNC(=O)Oc1ccc2C3CC(CCN3CC)c2c1
Show InChI InChI=1S/C20H30N2O2/c1-3-5-6-7-11-21-20(23)24-16-8-9-17-18(14-16)15-10-12-22(4-2)19(17)13-15/h8-9,14-15,19H,3-7,10-13H2,1-2H3,(H,21,23)
NCI pathway
Reactome pathway
n/an/a 125n/an/an/an/an/an/a
Pfizer Inc.
Curated by ChEMBL
Assay Description
In vitro inhibitory activity against human acetylcholinesterase
J Med Chem 37: 1996-2000 (1994)
BindingDB Entry DOI: 10.7270/Q2BZ654H
Acetylcholinesterase
(Mus musculus (mouse))
BDBM50038732
(CHEMBL413549 | Hexyl-carbamic acid 9-ethyl-9-aza-t...)
Show SMILES CCCCCCNC(=O)Oc1ccc2C3CC(CCN3CC)c2c1
Show InChI InChI=1S/C20H30N2O2/c1-3-5-6-7-11-21-20(23)24-16-8-9-17-18(14-16)15-10-12-22(4-2)19(17)13-15/h8-9,14-15,19H,3-7,10-13H2,1-2H3,(H,21,23)
Reactome pathway
n/an/a 156n/an/an/an/an/an/a
Pfizer Inc.
Curated by ChEMBL
Assay Description
Inhibitory activity against acetylcholinesterase in mice at the dose of 1.8 mg/kg via intraperitoneal administration
J Med Chem 37: 1996-2000 (1994)
BindingDB Entry DOI: 10.7270/Q2BZ654H