BDBM50038868 (R)-3-[(R)-3-((S)-2-1,2,3,4-Tetrahydro-naphthalen-2-yl-acetyl)-thiazolidine-4-carbonyl]-thiazolidine-4-carbaldehyde::CHEMBL65512
SMILES: O=C[C@@H]1CSCN1C(=O)[C@@H]1CSCN1C(=O)C[C@H]1CCc2ccccc2C1
InChI Key: InChIKey=XQPDOJIXUPYASU-QGTPRVQTSA-N
Data: 1 IC50
Activity Spreadsheet -- Enzyme Inhibition Constant Data from BindingDB
Found 1 hit for monomerid = 50038868
Trg + Lig
Ki
nM
ΔG°
kcal/mole
IC50
nM
Kd
nM
EC50/IC50
nM
koff
s-1
kon
M-1s-1
pHTemp
°C
Prolyl endopeptidase
(Homo sapiens (Human))
BDBM50038868
((R)-3-[(R)-3-((S)-2-1,2,3,4-Tetrahydro-naphthalen-...)
Show SMILES O=C[C@@H]1CSCN1C(=O)[C@@H]1CSCN1C(=O)C[C@H]1CCc2ccccc2C1
Show InChI InChI=1S/C20H24N2O3S2/c23-9-17-10-26-12-21(17)20(25)18-11-27-13-22(18)19(24)8-14-5-6-15-3-1-2-4-16(15)7-14/h1-4,9,14,17-18H,5-8,10-13H2/t14-,17+,18-/m0/s1
n/an/a 0.850n/an/an/an/an/an/a
Zeria Pharmaceutical Company, Ltd.
Curated by ChEMBL
Assay Description
In vitro inhibitory activity against purified prolyl endopeptidase (PEP) from canine brain.
J Med Chem 37: 2071-8 (1994)
BindingDB Entry DOI: 10.7270/Q270822J