BDBM50038895 1-[(R)-4-(Pyrrolidine-1-carbonyl)-thiazolidin-3-yl]-2-(S)-1,2,3,4-tetrahydro-naphthalen-2-yl-ethanone::CHEMBL66257
SMILES: O=C(C[C@H]1CCc2ccccc2C1)N1CSC[C@H]1C(=O)N1CCCC1
InChI Key: InChIKey=SARANMZOEFGESB-YJBOKZPZSA-N
Data: 1 IC50
Activity Spreadsheet -- Enzyme Inhibition Constant Data from BindingDB
Found 1 hit for monomerid = 50038895
Trg + Lig
Ki
nM
ΔG°
kcal/mole
IC50
nM
Kd
nM
EC50/IC50
nM
koff
s-1
kon
M-1s-1
pHTemp
°C
Prolyl endopeptidase
(Homo sapiens (Human))
BDBM50038895
(1-[(R)-4-(Pyrrolidine-1-carbonyl)-thiazolidin-3-yl...)
Show SMILES O=C(C[C@H]1CCc2ccccc2C1)N1CSC[C@H]1C(=O)N1CCCC1
Show InChI InChI=1S/C20H26N2O2S/c23-19(12-15-7-8-16-5-1-2-6-17(16)11-15)22-14-25-13-18(22)20(24)21-9-3-4-10-21/h1-2,5-6,15,18H,3-4,7-14H2/t15-,18-/m0/s1
n/an/a 4n/an/an/an/an/an/a
Zeria Pharmaceutical Company, Ltd.
Curated by ChEMBL
Assay Description
In vitro inhibitory activity against purified prolyl endopeptidase (PEP) from canine brain.
J Med Chem 37: 2071-8 (1994)
BindingDB Entry DOI: 10.7270/Q270822J