BDBM50038910 1-(6-Chloro-4-p-tolyl-quinolin-3-yl)-3-(2,4-difluoro-phenyl)-urea::CHEMBL67373
SMILES: Cc1ccc(cc1)-c1c(NC(=O)Nc2ccc(F)cc2F)cnc2ccc(Cl)cc12
InChI Key: InChIKey=HSMHDSNPKKSRFU-UHFFFAOYSA-N
Data: 1 IC50
Activity Spreadsheet -- Enzyme Inhibition Constant Data from BindingDB
Found 1 hit for monomerid = 50038910
Trg + Lig
Ki
nM
ΔG°
kcal/mole
IC50
nM
Kd
nM
EC50/IC50
nM
koff
s-1
kon
M-1s-1
pHTemp
°C
Sterol O-acyltransferase, Soat
(Rattus norvegicus)
BDBM50038910
(1-(6-Chloro-4-p-tolyl-quinolin-3-yl)-3-(2,4-difluo...)
Show SMILES Cc1ccc(cc1)-c1c(NC(=O)Nc2ccc(F)cc2F)cnc2ccc(Cl)cc12
Show InChI InChI=1S/C23H16ClF2N3O/c1-13-2-4-14(5-3-13)22-17-10-15(24)6-8-19(17)27-12-21(22)29-23(30)28-20-9-7-16(25)11-18(20)26/h2-12H,1H3,(H2,28,29,30)
n/an/a 160n/an/an/an/an/an/a
Takeda Chemical Industries, Ltd.
Curated by ChEMBL
Assay Description
Inhibitory activity against acyl coenzyme A:cholesterol acyltransferase in rat microsomes
J Med Chem 37: 2079-84 (1994)
BindingDB Entry DOI: 10.7270/Q23F4NPC