BDBM50038961 CHEMBL67676::N-Methyl-4-sulfamoyl-benzamide
SMILES: CNC(=O)c1ccc(cc1)S(N)(=O)=O
InChI Key: InChIKey=CTDFBRMMEMHBEO-UHFFFAOYSA-N
Data: 1 Kd
PDB links: 2 PDB IDs match this monomer.
Activity Spreadsheet -- Enzyme Inhibition Constant Data from BindingDB
Found 1 hit for monomerid = 50038961
Trg + Lig
Ki
nM
ΔG°
kcal/mole
IC50
nM
Kd
nM
EC50/IC50
nM
koff
s-1
kon
M-1s-1
pHTemp
°C
Carbonic anhydrase 2
(Homo sapiens (Human))
BDBM50038961
(CHEMBL67676 | N-Methyl-4-sulfamoyl-benzamide)
Show SMILES CNC(=O)c1ccc(cc1)S(N)(=O)=O
Show InChI InChI=1S/C8H10N2O3S/c1-10-8(11)6-2-4-7(5-3-6)14(9,12)13/h2-5H,1H3,(H,10,11)(H2,9,12,13)
Reactome pathway
n/an/an/a 150n/an/an/an/an/a
Harvard University
Curated by ChEMBL
Assay Description
Dissociation constant against human Carbonic anhydrase II (HCA II)
J Med Chem 37: 2100-5 (1994)
BindingDB Entry DOI: 10.7270/Q2TX3DDV