BDBM50039071 6,7-Dimethoxy-3-(4-methoxy-phenyl)-quinoline::CHEMBL70130
SMILES: COc1ccc(cc1)-c1cnc2cc(OC)c(OC)cc2c1
InChI Key: InChIKey=UNALZVYBWFUPTL-UHFFFAOYSA-N
Data: 2 IC50
Activity Spreadsheet -- Enzyme Inhibition Constant Data from BindingDB
Found 2 hits for monomerid = 50039071
Trg + Lig
Ki
nM
ΔG°
kcal/mole
IC50
nM
Kd
nM
EC50/IC50
nM
koff
s-1
kon
M-1s-1
pHTemp
°C
PDGFR-beta/Platelet-derived growth factor receptor alpha
(Homo sapiens (Human))
BDBM50039071
(6,7-Dimethoxy-3-(4-methoxy-phenyl)-quinoline | CHE...)
Show SMILES COc1ccc(cc1)-c1cnc2cc(OC)c(OC)cc2c1
Show InChI InChI=1S/C18H17NO3/c1-20-15-6-4-12(5-7-15)14-8-13-9-17(21-2)18(22-3)10-16(13)19-11-14/h4-11H,1-3H3
Reactome pathway
n/an/a 15n/an/an/an/an/an/a
Rhône-Poulenc Rorer Central Research
Curated by ChEMBL
Assay Description
Inhibition of human PDGF receptor phosphorylation; 0.001-0.015
J Med Chem 37: 2129-37 (1994)
BindingDB Entry DOI: 10.7270/Q29Z93Z8
Epidermal growth factor receptor
(Homo sapiens (Human))
BDBM50039071
(6,7-Dimethoxy-3-(4-methoxy-phenyl)-quinoline | CHE...)
Show SMILES COc1ccc(cc1)-c1cnc2cc(OC)c(OC)cc2c1
Show InChI InChI=1S/C18H17NO3/c1-20-15-6-4-12(5-7-15)14-8-13-9-17(21-2)18(22-3)10-16(13)19-11-14/h4-11H,1-3H3
n/an/a>2.00E+4n/an/an/an/an/an/a
Rhône-Poulenc Rorer Central Research
Curated by ChEMBL
Assay Description
Concentration required to inhibit phosphorylation of isolated human epidermal growth factor tyrosine kinase receptor by 50%
J Med Chem 37: 2129-37 (1994)
BindingDB Entry DOI: 10.7270/Q29Z93Z8