BDBM50039177 3-[Bis-(4-chloro-phenyl)-methoxy]-8-methyl-8-aza-bicyclo[3.2.1]octane; hydrochloride::CHEMBL119664::CHEMBL541825
SMILES: CN1C2CCC1CC(C2)OC(c1ccc(Cl)cc1)c1ccc(Cl)cc1
InChI Key: InChIKey=DAAKBMHWKLVSKY-UHFFFAOYSA-N
Data: 16 KI  2 IC50
Activity Spreadsheet -- Enzyme Inhibition Constant Data from BindingDB
Found 18 hits for monomerid = 50039177
Trg + Lig
Ki
nM
ΔG°
kcal/mole
IC50
nM
Kd
nM
EC50/IC50
nM
koff
s-1
kon
M-1s-1
pHTemp
°C
Sodium-dependent dopamine transporter
(Rattus norvegicus (rat))
BDBM50039177
(3-[Bis-(4-chloro-phenyl)-methoxy]-8-methyl-8-aza-b...)
Show SMILES CN1C2CCC1CC(C2)OC(c1ccc(Cl)cc1)c1ccc(Cl)cc1 |THB:9:7:1:3.4|
Show InChI InChI=1S/C21H23Cl2NO/c1-24-18-10-11-19(24)13-20(12-18)25-21(14-2-6-16(22)7-3-14)15-4-8-17(23)9-5-15/h2-9,18-21H,10-13H2,1H3
Reactome pathway
17.5n/an/an/an/an/an/an/an/a
National Institute on Drug Abuse-Intramural Research Program
Curated by ChEMBL
Assay Description
Displacement of [3H]WIN-35428 from DAT in Sprague-Dawley rat brain
J Med Chem 49: 6391-9 (2006)
Article DOI: 10.1021/jm060762q
BindingDB Entry DOI: 10.7270/Q2WD41D4
Sodium-dependent dopamine transporter
(Rattus norvegicus (rat))
BDBM50039177
(3-[Bis-(4-chloro-phenyl)-methoxy]-8-methyl-8-aza-b...)
Show SMILES CN1C2CCC1CC(C2)OC(c1ccc(Cl)cc1)c1ccc(Cl)cc1 |THB:9:7:1:3.4|
Show InChI InChI=1S/C21H23Cl2NO/c1-24-18-10-11-19(24)13-20(12-18)25-21(14-2-6-16(22)7-3-14)15-4-8-17(23)9-5-15/h2-9,18-21H,10-13H2,1H3
Reactome pathway
20n/an/an/an/an/an/an/an/a
National Institute on Drug Abuse - Intramural Research Program
Curated by ChEMBL
Assay Description
Displacement of [3H]WIN-35428 binding to the dopamine transporter in rat caudate putamen tissue.
J Med Chem 42: 3502-9 (1999)
Article DOI: 10.1021/jm980701v
BindingDB Entry DOI: 10.7270/Q2VD705D
Sodium-dependent dopamine transporter
(Rattus norvegicus (rat))
BDBM50039177
(3-[Bis-(4-chloro-phenyl)-methoxy]-8-methyl-8-aza-b...)
Show SMILES CN1C2CCC1CC(C2)OC(c1ccc(Cl)cc1)c1ccc(Cl)cc1 |THB:9:7:1:3.4|
Show InChI InChI=1S/C21H23Cl2NO/c1-24-18-10-11-19(24)13-20(12-18)25-21(14-2-6-16(22)7-3-14)15-4-8-17(23)9-5-15/h2-9,18-21H,10-13H2,1H3
Reactome pathway
20n/an/an/an/an/an/an/an/a
National Institute on Drug Abuse--Intramural Research Program
Curated by ChEMBL
Assay Description
Binding affinity at dopamine transporter in rat brain by [3H]WIN-35428 displacement.
J Med Chem 47: 3388-98 (2004)
Article DOI: 10.1021/jm030646c
BindingDB Entry DOI: 10.7270/Q2WS8TZ4
Sodium-dependent dopamine transporter
(Rattus norvegicus (rat))
BDBM50039177
(3-[Bis-(4-chloro-phenyl)-methoxy]-8-methyl-8-aza-b...)
Show SMILES CN1C2CCC1CC(C2)OC(c1ccc(Cl)cc1)c1ccc(Cl)cc1 |THB:9:7:1:3.4|
Show InChI InChI=1S/C21H23Cl2NO/c1-24-18-10-11-19(24)13-20(12-18)25-21(14-2-6-16(22)7-3-14)15-4-8-17(23)9-5-15/h2-9,18-21H,10-13H2,1H3
Reactome pathway
20n/an/an/an/an/an/an/an/a
National Institutes of Health
Curated by ChEMBL
Assay Description
Compound was evaluated for its ability to displace [3H]WIN-35428 binding in rat caudate-putamen
J Med Chem 37: 2258-61 (1994)
BindingDB Entry DOI: 10.7270/Q2FJ2HFZ
Sodium-dependent dopamine transporter
(Rattus norvegicus (rat))
BDBM50039177
(3-[Bis-(4-chloro-phenyl)-methoxy]-8-methyl-8-aza-b...)
Show SMILES CN1C2CCC1CC(C2)OC(c1ccc(Cl)cc1)c1ccc(Cl)cc1 |THB:9:7:1:3.4|
Show InChI InChI=1S/C21H23Cl2NO/c1-24-18-10-11-19(24)13-20(12-18)25-21(14-2-6-16(22)7-3-14)15-4-8-17(23)9-5-15/h2-9,18-21H,10-13H2,1H3
Reactome pathway
20n/an/an/an/an/an/an/an/a
National Institute on Drug Abuse-Intramural Research Program
Curated by ChEMBL
Assay Description
Binding affinity for dopamine transporter was determined in vitro in rat brain using [3H]WIN-35428 s radioligand
J Med Chem 44: 633-40 (2001)
BindingDB Entry DOI: 10.7270/Q2MP540N
Sodium-dependent dopamine transporter
(Homo sapiens (Human))
BDBM50039177
(3-[Bis-(4-chloro-phenyl)-methoxy]-8-methyl-8-aza-b...)
Show SMILES CN1C2CCC1CC(C2)OC(c1ccc(Cl)cc1)c1ccc(Cl)cc1 |THB:9:7:1:3.4|
Show InChI InChI=1S/C21H23Cl2NO/c1-24-18-10-11-19(24)13-20(12-18)25-21(14-2-6-16(22)7-3-14)15-4-8-17(23)9-5-15/h2-9,18-21H,10-13H2,1H3
NCI pathway
Reactome pathway
23.4n/an/an/an/an/an/an/an/a
Pomona College
Curated by ChEMBL
Assay Description
Ability of compound to inhibit dopamine uptake of receptor was determined
Bioorg Med Chem Lett 15: 2149-57 (2005)
Article DOI: 10.1016/j.bmcl.2005.02.012
BindingDB Entry DOI: 10.7270/Q2RR20G2
Muscarinic acetylcholine receptor M1
(RAT)
BDBM50039177
(3-[Bis-(4-chloro-phenyl)-methoxy]-8-methyl-8-aza-b...)
Show SMILES CN1C2CCC1CC(C2)OC(c1ccc(Cl)cc1)c1ccc(Cl)cc1 |THB:9:7:1:3.4|
Show InChI InChI=1S/C21H23Cl2NO/c1-24-18-10-11-19(24)13-20(12-18)25-21(14-2-6-16(22)7-3-14)15-4-8-17(23)9-5-15/h2-9,18-21H,10-13H2,1H3
Reactome pathway
40.6n/an/an/an/an/an/an/an/a
National Institute on Drug Abuse-Intramural Research Program
Curated by ChEMBL
Assay Description
Displacement of [3H]pirenzepine from M1 receptor in Sprague-Dawley rat brain
J Med Chem 49: 6391-9 (2006)
Article DOI: 10.1021/jm060762q
BindingDB Entry DOI: 10.7270/Q2WD41D4
Muscarinic acetylcholine receptor M1
(RAT)
BDBM50039177
(3-[Bis-(4-chloro-phenyl)-methoxy]-8-methyl-8-aza-b...)
Show SMILES CN1C2CCC1CC(C2)OC(c1ccc(Cl)cc1)c1ccc(Cl)cc1 |THB:9:7:1:3.4|
Show InChI InChI=1S/C21H23Cl2NO/c1-24-18-10-11-19(24)13-20(12-18)25-21(14-2-6-16(22)7-3-14)15-4-8-17(23)9-5-15/h2-9,18-21H,10-13H2,1H3
Reactome pathway
47.9n/an/an/an/an/an/an/an/a
National Institute on Drug Abuse-Intramural Research Program
Curated by ChEMBL
Assay Description
Binding affinity for muscarinic m1 receptor was determined in vitro in rat brain using [3H]pirenzepine as radioligand.
J Med Chem 44: 633-40 (2001)
BindingDB Entry DOI: 10.7270/Q2MP540N
Muscarinic acetylcholine receptor M1
(RAT)
BDBM50039177
(3-[Bis-(4-chloro-phenyl)-methoxy]-8-methyl-8-aza-b...)
Show SMILES CN1C2CCC1CC(C2)OC(c1ccc(Cl)cc1)c1ccc(Cl)cc1 |THB:9:7:1:3.4|
Show InChI InChI=1S/C21H23Cl2NO/c1-24-18-10-11-19(24)13-20(12-18)25-21(14-2-6-16(22)7-3-14)15-4-8-17(23)9-5-15/h2-9,18-21H,10-13H2,1H3
Reactome pathway
47.9n/an/an/an/an/an/an/an/a
National Institute on Drug Abuse--Intramural Research Program
Curated by ChEMBL
Assay Description
Binding affinity at muscarinic M1 receptor in rat brain by [3H]pirenzepine displacement.
J Med Chem 47: 3388-98 (2004)
Article DOI: 10.1021/jm030646c
BindingDB Entry DOI: 10.7270/Q2WS8TZ4
D(3) dopamine receptor
(Homo sapiens (Human))
BDBM50039177
(3-[Bis-(4-chloro-phenyl)-methoxy]-8-methyl-8-aza-b...)
Show SMILES CN1C2CCC1CC(C2)OC(c1ccc(Cl)cc1)c1ccc(Cl)cc1 |THB:9:7:1:3.4|
Show InChI InChI=1S/C21H23Cl2NO/c1-24-18-10-11-19(24)13-20(12-18)25-21(14-2-6-16(22)7-3-14)15-4-8-17(23)9-5-15/h2-9,18-21H,10-13H2,1H3
220n/an/an/an/an/an/an/an/a
National Institute on Drug Abuse-Intramural Research Program
Curated by ChEMBL
Assay Description
Binding affinity at dopamine receptor D3
J Med Chem 44: 3175-86 (2001)
BindingDB Entry DOI: 10.7270/Q2WD419S
Sodium-dependent serotonin transporter
(Rattus norvegicus (rat))
BDBM50039177
(3-[Bis-(4-chloro-phenyl)-methoxy]-8-methyl-8-aza-b...)
Show SMILES CN1C2CCC1CC(C2)OC(c1ccc(Cl)cc1)c1ccc(Cl)cc1 |THB:9:7:1:3.4|
Show InChI InChI=1S/C21H23Cl2NO/c1-24-18-10-11-19(24)13-20(12-18)25-21(14-2-6-16(22)7-3-14)15-4-8-17(23)9-5-15/h2-9,18-21H,10-13H2,1H3
1.64E+3n/an/an/an/an/an/an/an/a
National Institute on Drug Abuse--Intramural Research Program
Curated by ChEMBL
Assay Description
Binding affinity at serotonin transporter in rat brain by [3H]-citalopram displacement.
J Med Chem 47: 3388-98 (2004)
Article DOI: 10.1021/jm030646c
BindingDB Entry DOI: 10.7270/Q2WS8TZ4
Sodium-dependent serotonin transporter
(Rattus norvegicus (rat))
BDBM50039177
(3-[Bis-(4-chloro-phenyl)-methoxy]-8-methyl-8-aza-b...)
Show SMILES CN1C2CCC1CC(C2)OC(c1ccc(Cl)cc1)c1ccc(Cl)cc1 |THB:9:7:1:3.4|
Show InChI InChI=1S/C21H23Cl2NO/c1-24-18-10-11-19(24)13-20(12-18)25-21(14-2-6-16(22)7-3-14)15-4-8-17(23)9-5-15/h2-9,18-21H,10-13H2,1H3
1.64E+3n/an/an/an/an/an/an/an/a
National Institute on Drug Abuse-Intramural Research Program
Curated by ChEMBL
Assay Description
Binding affinity for serotonin transporter was determined in vitro in rat brain using [3H]citalopram as radioligand.
J Med Chem 44: 633-40 (2001)
BindingDB Entry DOI: 10.7270/Q2MP540N
Sodium-dependent serotonin transporter
(Rattus norvegicus (rat))
BDBM50039177
(3-[Bis-(4-chloro-phenyl)-methoxy]-8-methyl-8-aza-b...)
Show SMILES CN1C2CCC1CC(C2)OC(c1ccc(Cl)cc1)c1ccc(Cl)cc1 |THB:9:7:1:3.4|
Show InChI InChI=1S/C21H23Cl2NO/c1-24-18-10-11-19(24)13-20(12-18)25-21(14-2-6-16(22)7-3-14)15-4-8-17(23)9-5-15/h2-9,18-21H,10-13H2,1H3
1.64E+3n/an/an/an/an/an/an/an/a
National Institute on Drug Abuse-Intramural Research Program
Curated by ChEMBL
Assay Description
Displacement of [3H]citalopram from SERT in Sprague-Dawley rat brain
J Med Chem 49: 6391-9 (2006)
Article DOI: 10.1021/jm060762q
BindingDB Entry DOI: 10.7270/Q2WD41D4
Norepinephrine Monoamine transporters
(Rattus norvegicus)
BDBM50039177
(3-[Bis-(4-chloro-phenyl)-methoxy]-8-methyl-8-aza-b...)
Show SMILES CN1C2CCC1CC(C2)OC(c1ccc(Cl)cc1)c1ccc(Cl)cc1 |THB:9:7:1:3.4|
Show InChI InChI=1S/C21H23Cl2NO/c1-24-18-10-11-19(24)13-20(12-18)25-21(14-2-6-16(22)7-3-14)15-4-8-17(23)9-5-15/h2-9,18-21H,10-13H2,1H3
Reactome pathway
2.98E+3n/an/an/an/an/an/an/an/a
National Institute on Drug Abuse-Intramural Research Program
Curated by ChEMBL
Assay Description
Binding affinity for norepinephrine transporter in rat brain using [3H]-nisoxatine as radioligand
J Med Chem 44: 633-40 (2001)
BindingDB Entry DOI: 10.7270/Q2MP540N
Norepinephrine Monoamine transporters
(Rattus norvegicus)
BDBM50039177
(3-[Bis-(4-chloro-phenyl)-methoxy]-8-methyl-8-aza-b...)
Show SMILES CN1C2CCC1CC(C2)OC(c1ccc(Cl)cc1)c1ccc(Cl)cc1 |THB:9:7:1:3.4|
Show InChI InChI=1S/C21H23Cl2NO/c1-24-18-10-11-19(24)13-20(12-18)25-21(14-2-6-16(22)7-3-14)15-4-8-17(23)9-5-15/h2-9,18-21H,10-13H2,1H3
Reactome pathway
2.98E+3n/an/an/an/an/an/an/an/a
National Institute on Drug Abuse--Intramural Research Program
Curated by ChEMBL
Assay Description
Displacement of [3H]nisoxetine from norepinephrine transporter (NET) of rat brain
J Med Chem 47: 3388-98 (2004)
Article DOI: 10.1021/jm030646c
BindingDB Entry DOI: 10.7270/Q2WS8TZ4
Norepinephrine Monoamine transporters
(Rattus norvegicus)
BDBM50039177
(3-[Bis-(4-chloro-phenyl)-methoxy]-8-methyl-8-aza-b...)
Show SMILES CN1C2CCC1CC(C2)OC(c1ccc(Cl)cc1)c1ccc(Cl)cc1 |THB:9:7:1:3.4|
Show InChI InChI=1S/C21H23Cl2NO/c1-24-18-10-11-19(24)13-20(12-18)25-21(14-2-6-16(22)7-3-14)15-4-8-17(23)9-5-15/h2-9,18-21H,10-13H2,1H3
Reactome pathway
2.98E+3n/an/an/an/an/an/an/an/a
National Institute on Drug Abuse-Intramural Research Program
Curated by ChEMBL
Assay Description
Displacement of [3H]nisoxetine from NET in Sprague-Dawley rat brain
J Med Chem 49: 6391-9 (2006)
Article DOI: 10.1021/jm060762q
BindingDB Entry DOI: 10.7270/Q2WD41D4
Sodium-dependent dopamine transporter
(Rattus norvegicus (rat))
BDBM50039177
(3-[Bis-(4-chloro-phenyl)-methoxy]-8-methyl-8-aza-b...)
Show SMILES CN1C2CCC1CC(C2)OC(c1ccc(Cl)cc1)c1ccc(Cl)cc1 |THB:9:7:1:3.4|
Show InChI InChI=1S/C21H23Cl2NO/c1-24-18-10-11-19(24)13-20(12-18)25-21(14-2-6-16(22)7-3-14)15-4-8-17(23)9-5-15/h2-9,18-21H,10-13H2,1H3
Reactome pathway
n/an/a 75n/an/an/an/an/an/a
National Institute on Drug Abuse - Intramural Research Program
Curated by ChEMBL
Assay Description
Inhibition of [3H]dopamine uptake in rat caudate putamen tissue.
J Med Chem 42: 3502-9 (1999)
Article DOI: 10.1021/jm980701v
BindingDB Entry DOI: 10.7270/Q2VD705D
Sodium-dependent dopamine transporter
(Rattus norvegicus (rat))
BDBM50039177
(3-[Bis-(4-chloro-phenyl)-methoxy]-8-methyl-8-aza-b...)
Show SMILES CN1C2CCC1CC(C2)OC(c1ccc(Cl)cc1)c1ccc(Cl)cc1 |THB:9:7:1:3.4|
Show InChI InChI=1S/C21H23Cl2NO/c1-24-18-10-11-19(24)13-20(12-18)25-21(14-2-6-16(22)7-3-14)15-4-8-17(23)9-5-15/h2-9,18-21H,10-13H2,1H3
Reactome pathway
n/an/a 23.4n/an/an/an/an/an/a
National Institute on Drug Abuse-Intramural Research Program
Curated by ChEMBL
Assay Description
Inhibition of [3H]dopamine uptake at DAT in Sprague-Dawley rat brain
J Med Chem 49: 6391-9 (2006)
Article DOI: 10.1021/jm060762q
BindingDB Entry DOI: 10.7270/Q2WD41D4