BDBM50039493 CHEMBL3357333
SMILES: [NH4+].[H][C@]12CS[C@@H](CCCCC(=O)CP([O-])(=O)OC[C@H]3O[C@H]([C@H](O)[C@@H]3O)n3cnc4c(N)ncnc34)[C@@]1([H])NC(=O)N2
InChI Key: InChIKey=QICGQTVIIQQAIN-VWULNXFCSA-M
Data: 1 KI  1 IC50
Activity Spreadsheet -- Enzyme Inhibition Constant Data from BindingDB
Found 2 hits for monomerid = 50039493
Trg + Lig
Ki
nM
ΔG°
kcal/mole
IC50
nM
Kd
nM
EC50/IC50
nM
koff
s-1
kon
M-1s-1
pHTemp
°C
Biotin--protein ligase
(Homo sapiens (Human))
BDBM50039493
(CHEMBL3357333)
Show SMILES [NH4+].[H][C@]12CS[C@@H](CCCCC(=O)CP([O-])(=O)OC[C@H]3O[C@H]([C@H](O)[C@@H]3O)n3cnc4c(N)ncnc34)[C@@]1([H])NC(=O)N2 |r|
Show InChI InChI=1S/C21H30N7O8PS/c22-18-15-19(24-8-23-18)28(9-25-15)20-17(31)16(30)12(36-20)5-35-37(33,34)6-10(29)3-1-2-4-13-14-11(7-38-13)26-21(32)27-14/h8-9,11-14,16-17,20,30-31H,1-7H2,(H,33,34)(H2,22,23,24)(H2,26,27,32)/p-1/t11-,12+,13-,14-,16+,17+,20+/m0/s1
Reactome pathway
2.00E+3n/an/an/an/an/an/an/an/a
University of Nebraska-Lincoln
Curated by ChEMBL
Assay Description
Inhibition of human recombinant HLCS using P67 as substrate after 2 hrs relative to vehicle-treated control
Bioorg Med Chem Lett 24: 5568-71 (2014)
Article DOI: 10.1016/j.bmcl.2014.11.010
BindingDB Entry DOI: 10.7270/Q2W097KM
Biotin--protein ligase
(Homo sapiens (Human))
BDBM50039493
(CHEMBL3357333)
Show SMILES [NH4+].[H][C@]12CS[C@@H](CCCCC(=O)CP([O-])(=O)OC[C@H]3O[C@H]([C@H](O)[C@@H]3O)n3cnc4c(N)ncnc34)[C@@]1([H])NC(=O)N2 |r|
Show InChI InChI=1S/C21H30N7O8PS/c22-18-15-19(24-8-23-18)28(9-25-15)20-17(31)16(30)12(36-20)5-35-37(33,34)6-10(29)3-1-2-4-13-14-11(7-38-13)26-21(32)27-14/h8-9,11-14,16-17,20,30-31H,1-7H2,(H,33,34)(H2,22,23,24)(H2,26,27,32)/p-1/t11-,12+,13-,14-,16+,17+,20+/m0/s1
Reactome pathway
n/an/a 3.97E+4n/an/an/an/an/an/a
University of Nebraska-Lincoln
Curated by ChEMBL
Assay Description
Inhibition of human recombinant HLCS using P67 as substrate after 2 hrs relative to vehicle-treated control
Bioorg Med Chem Lett 24: 5568-71 (2014)
Article DOI: 10.1016/j.bmcl.2014.11.010
BindingDB Entry DOI: 10.7270/Q2W097KM