BDBM50039538 (R)-2-(2-Mercaptomethyl-3-phenyl-propionylamino)-4-methylsulfanyl-butyric acid::CHEMBL79134
SMILES: CSCC[C@@H](NC(=O)C(CS)Cc1ccccc1)C(O)=O
InChI Key: InChIKey=HNZBQOSYCFLCAE-ZGTCLIOFSA-N
Data: 2 IC50
Activity Spreadsheet -- Enzyme Inhibition Constant Data from BindingDB
Found 2 hits for monomerid = 50039538
Trg + Lig
Ki
nM
ΔG°
kcal/mole
IC50
nM
Kd
nM
EC50/IC50
nM
koff
s-1
kon
M-1s-1
pHTemp
°C
Neprilysin
(Oryctolagus cuniculus (rabbit))
BDBM50039538
((R)-2-(2-Mercaptomethyl-3-phenyl-propionylamino)-4...)
Show SMILES CSCC[C@@H](NC(=O)C(CS)Cc1ccccc1)C(O)=O
Show InChI InChI=1S/C15H21NO3S2/c1-21-8-7-13(15(18)19)16-14(17)12(10-20)9-11-5-3-2-4-6-11/h2-6,12-13,20H,7-10H2,1H3,(H,16,17)(H,18,19)/t12?,13-/m1/s1
n/an/a 4n/an/an/an/an/an/a
Schering-Plough Research Institute
Curated by ChEMBL
Assay Description
In vitro inhibitory activity against neutral endopeptidase (NEP)
J Med Chem 37: 2461-76 (1994)
BindingDB Entry DOI: 10.7270/Q2571B20
Angiotensin-converting enzyme
(Oryctolagus cuniculus)
BDBM50039538
((R)-2-(2-Mercaptomethyl-3-phenyl-propionylamino)-4...)
Show SMILES CSCC[C@@H](NC(=O)C(CS)Cc1ccccc1)C(O)=O
Show InChI InChI=1S/C15H21NO3S2/c1-21-8-7-13(15(18)19)16-14(17)12(10-20)9-11-5-3-2-4-6-11/h2-6,12-13,20H,7-10H2,1H3,(H,16,17)(H,18,19)/t12?,13-/m1/s1
n/an/a 120n/an/an/an/an/an/a
Schering-Plough Research Institute
Curated by ChEMBL
Assay Description
Tested in vitro for its inhibitory activity against angiotensin converting enzyme
J Med Chem 37: 2461-76 (1994)
BindingDB Entry DOI: 10.7270/Q2571B20