BDBM50039715 3-[2-(1-Benzyl-piperidin-4-yl)-ethyl]-benzo[d]isothiazole::CHEMBL328102
SMILES: C(Cc1nsc2ccccc12)C1CCN(Cc2ccccc2)CC1
InChI Key: InChIKey=QMQQOVGCVPEGSA-UHFFFAOYSA-N
Data: 4 IC50
Activity Spreadsheet -- Enzyme Inhibition Constant Data from BindingDB
Found 4 hits for monomerid = 50039715
Trg + Lig
Ki
nM
ΔG°
kcal/mole
IC50
nM
Kd
nM
EC50/IC50
nM
koff
s-1
kon
M-1s-1
pHTemp
°C
Acetylcholinesterase
(Homo sapiens (Human))
BDBM50039715
(3-[2-(1-Benzyl-piperidin-4-yl)-ethyl]-benzo[d]isot...)
Show SMILES C(Cc1nsc2ccccc12)C1CCN(Cc2ccccc2)CC1
Show InChI InChI=1S/C21H24N2S/c1-2-6-18(7-3-1)16-23-14-12-17(13-15-23)10-11-20-19-8-4-5-9-21(19)24-22-20/h1-9,17H,10-16H2
NCI pathway
Reactome pathway
n/an/a 100n/an/an/an/an/an/a
Universidade Federal do Rio de Janeiro (UFRJ)
Curated by ChEMBL
Assay Description
Inhibition of human acetylcholinesterase
Eur J Med Chem 46: 39-51 (2010)
Article DOI: 10.1016/j.ejmech.2010.10.009
BindingDB Entry DOI: 10.7270/Q2SX6FG0
Acetylcholinesterase
(Homo sapiens (Human))
BDBM50039715
(3-[2-(1-Benzyl-piperidin-4-yl)-ethyl]-benzo[d]isot...)
Show SMILES C(Cc1nsc2ccccc12)C1CCN(Cc2ccccc2)CC1
Show InChI InChI=1S/C21H24N2S/c1-2-6-18(7-3-1)16-23-14-12-17(13-15-23)10-11-20-19-8-4-5-9-21(19)24-22-20/h1-9,17H,10-16H2
NCI pathway
Reactome pathway
n/an/a 97.7n/an/an/an/an/an/a
University of Missouri-St. Louis
Curated by ChEMBL
Assay Description
Inhibition against Acetylcholinesterase (AChE)
J Med Chem 39: 380-7 (1996)
Article DOI: 10.1021/jm950704x
BindingDB Entry DOI: 10.7270/Q25D8T1Q
Acetylcholinesterase
(Homo sapiens (Human))
BDBM50039715
(3-[2-(1-Benzyl-piperidin-4-yl)-ethyl]-benzo[d]isot...)
Show SMILES C(Cc1nsc2ccccc12)C1CCN(Cc2ccccc2)CC1
Show InChI InChI=1S/C21H24N2S/c1-2-6-18(7-3-1)16-23-14-12-17(13-15-23)10-11-20-19-8-4-5-9-21(19)24-22-20/h1-9,17H,10-16H2
NCI pathway
Reactome pathway
n/an/a 99n/an/an/an/an/an/a
University of Kansas
Curated by ChEMBL
Assay Description
Inhibitory activity against Acetylcholinesterase enzyme using human AChE assay
J Med Chem 47: 5492-500 (2004)
Article DOI: 10.1021/jm049695v
BindingDB Entry DOI: 10.7270/Q2765G3W
Acetylcholinesterase
(Homo sapiens (Human))
BDBM50039715
(3-[2-(1-Benzyl-piperidin-4-yl)-ethyl]-benzo[d]isot...)
Show SMILES C(Cc1nsc2ccccc12)C1CCN(Cc2ccccc2)CC1
Show InChI InChI=1S/C21H24N2S/c1-2-6-18(7-3-1)16-23-14-12-17(13-15-23)10-11-20-19-8-4-5-9-21(19)24-22-20/h1-9,17H,10-16H2
NCI pathway
Reactome pathway
n/an/a 99n/an/an/an/an/an/a
Pfizer Inc.
Curated by ChEMBL
Assay Description
Evaluated for the in vitro inhibition of the Acetylcholinesterase (AChE) from human erythrocytes
J Med Chem 37: 2721-34 (1994)
BindingDB Entry DOI: 10.7270/Q2VT1R4X