BDBM50039717 3-(2-(1-benzylpiperidin-4-yl)ethyl)-6-methoxybenzo[d]isoxazole::3-[2-(1-Benzyl-piperidin-4-yl)-ethyl]-6-methoxy-benzo[d]isoxazole::CHEMBL418955
SMILES: COc1ccc2c(CCC3CCN(Cc4ccccc4)CC3)noc2c1
InChI Key: InChIKey=VFDQMJCSKFAKRY-UHFFFAOYSA-N
Data: 5 IC50
Activity Spreadsheet -- Enzyme Inhibition Constant Data from BindingDB
Found 5 hits for monomerid = 50039717
Trg + Lig
Ki
nM
ΔG°
kcal/mole
IC50
nM
Kd
nM
EC50/IC50
nM
koff
s-1
kon
M-1s-1
pHTemp
°C
Acetylcholinesterase
(Homo sapiens (Human))
BDBM50039717
(3-(2-(1-benzylpiperidin-4-yl)ethyl)-6-methoxybenzo...)
Show SMILES COc1ccc2c(CCC3CCN(Cc4ccccc4)CC3)noc2c1
Show InChI InChI=1S/C22H26N2O2/c1-25-19-8-9-20-21(23-26-22(20)15-19)10-7-17-11-13-24(14-12-17)16-18-5-3-2-4-6-18/h2-6,8-9,15,17H,7,10-14,16H2,1H3
NCI pathway
Reactome pathway
n/an/a 8.32n/an/an/an/an/an/a
Universidade Federal do Rio de Janeiro (UFRJ)
Curated by ChEMBL
Assay Description
Inhibition of human acetylcholinesterase
Eur J Med Chem 46: 39-51 (2010)
Article DOI: 10.1016/j.ejmech.2010.10.009
BindingDB Entry DOI: 10.7270/Q2SX6FG0
Acetylcholinesterase
(Homo sapiens (Human))
BDBM50039717
(3-(2-(1-benzylpiperidin-4-yl)ethyl)-6-methoxybenzo...)
Show SMILES COc1ccc2c(CCC3CCN(Cc4ccccc4)CC3)noc2c1
Show InChI InChI=1S/C22H26N2O2/c1-25-19-8-9-20-21(23-26-22(20)15-19)10-7-17-11-13-24(14-12-17)16-18-5-3-2-4-6-18/h2-6,8-9,15,17H,7,10-14,16H2,1H3
NCI pathway
Reactome pathway
n/an/a 8.30n/an/an/an/an/an/a
Pfizer Inc.
Curated by ChEMBL
Assay Description
Evaluated for the in vitro inhibition of the Acetylcholinesterase (AChE) from human erythrocytes
J Med Chem 37: 2721-34 (1994)
BindingDB Entry DOI: 10.7270/Q2VT1R4X
Acetylcholinesterase
(Homo sapiens (Human))
BDBM50039717
(3-(2-(1-benzylpiperidin-4-yl)ethyl)-6-methoxybenzo...)
Show SMILES COc1ccc2c(CCC3CCN(Cc4ccccc4)CC3)noc2c1
Show InChI InChI=1S/C22H26N2O2/c1-25-19-8-9-20-21(23-26-22(20)15-19)10-7-17-11-13-24(14-12-17)16-18-5-3-2-4-6-18/h2-6,8-9,15,17H,7,10-14,16H2,1H3
NCI pathway
Reactome pathway
n/an/a 8.30n/an/an/an/an/an/a
University of Missouri-St. Louis
Curated by ChEMBL
Assay Description
Inhibition against Acetylcholinesterase (AChE)
J Med Chem 39: 380-7 (1996)
Article DOI: 10.1021/jm950704x
BindingDB Entry DOI: 10.7270/Q25D8T1Q
Acetylcholinesterase
(Homo sapiens (Human))
BDBM50039717
(3-(2-(1-benzylpiperidin-4-yl)ethyl)-6-methoxybenzo...)
Show SMILES COc1ccc2c(CCC3CCN(Cc4ccccc4)CC3)noc2c1
Show InChI InChI=1S/C22H26N2O2/c1-25-19-8-9-20-21(23-26-22(20)15-19)10-7-17-11-13-24(14-12-17)16-18-5-3-2-4-6-18/h2-6,8-9,15,17H,7,10-14,16H2,1H3
NCI pathway
Reactome pathway
n/an/a 8.30n/an/an/an/an/an/a
University of Kansas
Curated by ChEMBL
Assay Description
Inhibitory activity against Acetylcholinesterase enzyme using human AChE assay
J Med Chem 47: 5492-500 (2004)
Article DOI: 10.1021/jm049695v
BindingDB Entry DOI: 10.7270/Q2765G3W
Acetylcholinesterase
(Homo sapiens (Human))
BDBM50039717
(3-(2-(1-benzylpiperidin-4-yl)ethyl)-6-methoxybenzo...)
Show SMILES COc1ccc2c(CCC3CCN(Cc4ccccc4)CC3)noc2c1
Show InChI InChI=1S/C22H26N2O2/c1-25-19-8-9-20-21(23-26-22(20)15-19)10-7-17-11-13-24(14-12-17)16-18-5-3-2-4-6-18/h2-6,8-9,15,17H,7,10-14,16H2,1H3
NCI pathway
Reactome pathway
n/an/a 8.80n/an/an/an/an/an/a
Sichuan University
Curated by ChEMBL
Assay Description
Inhibition of AChE
Eur J Med Chem 45: 1167-72 (2010)
Article DOI: 10.1016/j.ejmech.2009.12.038
BindingDB Entry DOI: 10.7270/Q25H7GFM