BDBM50039853 4'-[3-Butyl-5-oxo-1-(2-trifluoromethyl-phenyl)-1,5-dihydro-[1,2,4]triazol-4-ylmethyl]-biphenyl-2-sulfonic acid (2,2-dimethyl-cyclopropanecarbonyl)-amide::CHEMBL317547
SMILES: CCCCc1nn(-c2ccccc2C(F)(F)F)c(=O)n1Cc1ccc(cc1)-c1ccccc1S(=O)(=O)NC(=O)C1CC1(C)C
InChI Key: InChIKey=SJGJRWCAQBHZQD-UHFFFAOYSA-N
Data: 2 IC50
Activity Spreadsheet -- Enzyme Inhibition Constant Data from BindingDB
Found 2 hits for monomerid = 50039853
Trg + Lig
Ki
nM
ΔG°
kcal/mole
IC50
nM
Kd
nM
EC50/IC50
nM
koff
s-1
kon
M-1s-1
pHTemp
°C
Angiotensin II AT2
(RAT)
BDBM50039853
(4'-[3-Butyl-5-oxo-1-(2-trifluoromethyl-phenyl)-1,5...)
Show SMILES CCCCc1nn(-c2ccccc2C(F)(F)F)c(=O)n1Cc1ccc(cc1)-c1ccccc1S(=O)(=O)NC(=O)C1CC1(C)C
Show InChI InChI=1S/C32H33F3N4O4S/c1-4-5-14-28-36-39(26-12-8-7-11-24(26)32(33,34)35)30(41)38(28)20-21-15-17-22(18-16-21)23-10-6-9-13-27(23)44(42,43)37-29(40)25-19-31(25,2)3/h6-13,15-18,25H,4-5,14,19-20H2,1-3H3,(H,37,40)
n/an/a 220n/an/an/an/an/an/a
Merck Research Laboratories
Curated by ChEMBL
Assay Description
In vitro inhibitory activity against angiotensin II rat midbrain AT2 receptor using radioligand [125I]-Sar Ile-AII
J Med Chem 37: 2808-24 (1994)
BindingDB Entry DOI: 10.7270/Q2M907QM
Angiotensin II type 1a (AT-1a) receptor
(RABBIT)
BDBM50039853
(4'-[3-Butyl-5-oxo-1-(2-trifluoromethyl-phenyl)-1,5...)
Show SMILES CCCCc1nn(-c2ccccc2C(F)(F)F)c(=O)n1Cc1ccc(cc1)-c1ccccc1S(=O)(=O)NC(=O)C1CC1(C)C
Show InChI InChI=1S/C32H33F3N4O4S/c1-4-5-14-28-36-39(26-12-8-7-11-24(26)32(33,34)35)30(41)38(28)20-21-15-17-22(18-16-21)23-10-6-9-13-27(23)44(42,43)37-29(40)25-19-31(25,2)3/h6-13,15-18,25H,4-5,14,19-20H2,1-3H3,(H,37,40)
n/an/a 0.360n/an/an/an/an/an/a
Merck Research Laboratories
Curated by ChEMBL
Assay Description
In vitro inhibitory activity against angiotensin II rabbit aorta AT1 receptor using radioligand [125I]-Sar Ile-AII
J Med Chem 37: 2808-24 (1994)
BindingDB Entry DOI: 10.7270/Q2M907QM