BDBM50039887 4'-[3-Butyl-5-oxo-1-(2-trifluoromethyl-phenyl)-1,5-dihydro-[1,2,4]triazol-4-ylmethyl]-biphenyl-2-sulfonic acid (benzofuran-2-carbonyl)-amide; compound with ethoxy-ethane::CHEMBL98068
SMILES: CCCCc1nn(-c2ccccc2C(F)(F)F)c(=O)n1Cc1ccc(cc1)-c1ccccc1S(=O)(=O)NC(=O)c1cc2ccccc2o1
InChI Key: InChIKey=SGYXRZTXQJMDGN-UHFFFAOYSA-N
Data: 2 IC50
Activity Spreadsheet -- Enzyme Inhibition Constant Data from BindingDB
Found 2 hits for monomerid = 50039887
Trg + Lig
Ki
nM
ΔG°
kcal/mole
IC50
nM
Kd
nM
EC50/IC50
nM
koff
s-1
kon
M-1s-1
pHTemp
°C
Angiotensin II AT2
(RAT)
BDBM50039887
(4'-[3-Butyl-5-oxo-1-(2-trifluoromethyl-phenyl)-1,5...)
Show SMILES CCCCc1nn(-c2ccccc2C(F)(F)F)c(=O)n1Cc1ccc(cc1)-c1ccccc1S(=O)(=O)NC(=O)c1cc2ccccc2o1
Show InChI InChI=1S/C35H29F3N4O5S/c1-2-3-16-32-39-42(28-13-7-6-12-27(28)35(36,37)38)34(44)41(32)22-23-17-19-24(20-18-23)26-11-5-9-15-31(26)48(45,46)40-33(43)30-21-25-10-4-8-14-29(25)47-30/h4-15,17-21H,2-3,16,22H2,1H3,(H,40,43)
n/an/a 160n/an/an/an/an/an/a
Merck Research Laboratories
Curated by ChEMBL
Assay Description
In vitro inhibitory activity against angiotensin II rat midbrain AT2 receptor using radioligand [125I]-Sar Ile-AII
J Med Chem 37: 2808-24 (1994)
BindingDB Entry DOI: 10.7270/Q2M907QM
Angiotensin II type 1a (AT-1a) receptor
(RABBIT)
BDBM50039887
(4'-[3-Butyl-5-oxo-1-(2-trifluoromethyl-phenyl)-1,5...)
Show SMILES CCCCc1nn(-c2ccccc2C(F)(F)F)c(=O)n1Cc1ccc(cc1)-c1ccccc1S(=O)(=O)NC(=O)c1cc2ccccc2o1
Show InChI InChI=1S/C35H29F3N4O5S/c1-2-3-16-32-39-42(28-13-7-6-12-27(28)35(36,37)38)34(44)41(32)22-23-17-19-24(20-18-23)26-11-5-9-15-31(26)48(45,46)40-33(43)30-21-25-10-4-8-14-29(25)47-30/h4-15,17-21H,2-3,16,22H2,1H3,(H,40,43)
n/an/a 0.170n/an/an/an/an/an/a
Merck Research Laboratories
Curated by ChEMBL
Assay Description
In vitro inhibitory activity against angiotensin II rabbit aorta AT1 receptor using radioligand [125I]-Sar Ile-AII
J Med Chem 37: 2808-24 (1994)
BindingDB Entry DOI: 10.7270/Q2M907QM