BDBM50039922 4'-[3-Butyl-5-oxo-1-(2-trifluoromethyl-phenyl)-1,5-dihydro-[1,2,4]triazol-4-ylmethyl]-biphenyl-2-sulfonic acid (furan-2-carbonyl)-amide::CHEMBL95579
SMILES: CCCCc1nn(-c2ccccc2C(F)(F)F)c(=O)n1Cc1ccc(cc1)-c1ccccc1S(=O)(=O)NC(=O)c1ccco1
InChI Key: InChIKey=OQYLAHYLTMNIEX-UHFFFAOYSA-N
Data: 2 IC50
Activity Spreadsheet -- Enzyme Inhibition Constant Data from BindingDB
Found 2 hits for monomerid = 50039922
Trg + Lig
Ki
nM
ΔG°
kcal/mole
IC50
nM
Kd
nM
EC50/IC50
nM
koff
s-1
kon
M-1s-1
pHTemp
°C
Angiotensin II AT2
(RAT)
BDBM50039922
(4'-[3-Butyl-5-oxo-1-(2-trifluoromethyl-phenyl)-1,5...)
Show SMILES CCCCc1nn(-c2ccccc2C(F)(F)F)c(=O)n1Cc1ccc(cc1)-c1ccccc1S(=O)(=O)NC(=O)c1ccco1
Show InChI InChI=1S/C31H27F3N4O5S/c1-2-3-14-28-35-38(25-11-6-5-10-24(25)31(32,33)34)30(40)37(28)20-21-15-17-22(18-16-21)23-9-4-7-13-27(23)44(41,42)36-29(39)26-12-8-19-43-26/h4-13,15-19H,2-3,14,20H2,1H3,(H,36,39)
n/an/a 120n/an/an/an/an/an/a
Merck Research Laboratories
Curated by ChEMBL
Assay Description
In vitro inhibitory activity against angiotensin II rat midbrain AT2 receptor using radioligand [125I]-Sar Ile-AII
J Med Chem 37: 2808-24 (1994)
BindingDB Entry DOI: 10.7270/Q2M907QM
Angiotensin II type 1a (AT-1a) receptor
(RABBIT)
BDBM50039922
(4'-[3-Butyl-5-oxo-1-(2-trifluoromethyl-phenyl)-1,5...)
Show SMILES CCCCc1nn(-c2ccccc2C(F)(F)F)c(=O)n1Cc1ccc(cc1)-c1ccccc1S(=O)(=O)NC(=O)c1ccco1
Show InChI InChI=1S/C31H27F3N4O5S/c1-2-3-14-28-35-38(25-11-6-5-10-24(25)31(32,33)34)30(40)37(28)20-21-15-17-22(18-16-21)23-9-4-7-13-27(23)44(41,42)36-29(39)26-12-8-19-43-26/h4-13,15-19H,2-3,14,20H2,1H3,(H,36,39)
n/an/a 0.260n/an/an/an/an/an/a
Merck Research Laboratories
Curated by ChEMBL
Assay Description
In vitro inhibitory activity against angiotensin II rabbit aorta AT1 receptor using radioligand [125I]-Sar Ile-AII
J Med Chem 37: 2808-24 (1994)
BindingDB Entry DOI: 10.7270/Q2M907QM