BDBM50039924 4'-[3-Butyl-5-oxo-1-(2-trifluoromethyl-phenyl)-1,5-dihydro-[1,2,4]triazol-4-ylmethyl]-biphenyl-2-sulfonic acid cyclopentanecarbonyl-amide::CHEMBL316273
SMILES: CCCCc1nn(-c2ccccc2C(F)(F)F)c(=O)n1Cc1ccc(cc1)-c1ccccc1S(=O)(=O)NC(=O)C1CCCC1
InChI Key: InChIKey=BPMHTBBVCZRJAP-UHFFFAOYSA-N
Data: 2 IC50
Activity Spreadsheet -- Enzyme Inhibition Constant Data from BindingDB
Found 2 hits for monomerid = 50039924
Trg + Lig
Ki
nM
ΔG°
kcal/mole
IC50
nM
Kd
nM
EC50/IC50
nM
koff
s-1
kon
M-1s-1
pHTemp
°C
Angiotensin II AT2
(RAT)
BDBM50039924
(4'-[3-Butyl-5-oxo-1-(2-trifluoromethyl-phenyl)-1,5...)
Show SMILES CCCCc1nn(-c2ccccc2C(F)(F)F)c(=O)n1Cc1ccc(cc1)-c1ccccc1S(=O)(=O)NC(=O)C1CCCC1
Show InChI InChI=1S/C32H33F3N4O4S/c1-2-3-16-29-36-39(27-14-8-7-13-26(27)32(33,34)35)31(41)38(29)21-22-17-19-23(20-18-22)25-12-6-9-15-28(25)44(42,43)37-30(40)24-10-4-5-11-24/h6-9,12-15,17-20,24H,2-5,10-11,16,21H2,1H3,(H,37,40)
n/an/a 82n/an/an/an/an/an/a
Merck Research Laboratories
Curated by ChEMBL
Assay Description
In vitro inhibitory activity against angiotensin II rat midbrain AT2 receptor using radioligand [125I]-Sar Ile-AII
J Med Chem 37: 2808-24 (1994)
BindingDB Entry DOI: 10.7270/Q2M907QM
Angiotensin II type 1a (AT-1a) receptor
(RABBIT)
BDBM50039924
(4'-[3-Butyl-5-oxo-1-(2-trifluoromethyl-phenyl)-1,5...)
Show SMILES CCCCc1nn(-c2ccccc2C(F)(F)F)c(=O)n1Cc1ccc(cc1)-c1ccccc1S(=O)(=O)NC(=O)C1CCCC1
Show InChI InChI=1S/C32H33F3N4O4S/c1-2-3-16-29-36-39(27-14-8-7-13-26(27)32(33,34)35)31(41)38(29)21-22-17-19-23(20-18-22)25-12-6-9-15-28(25)44(42,43)37-30(40)24-10-4-5-11-24/h6-9,12-15,17-20,24H,2-5,10-11,16,21H2,1H3,(H,37,40)
n/an/a 0.320n/an/an/an/an/an/a
Merck Research Laboratories
Curated by ChEMBL
Assay Description
In vitro inhibitory activity against angiotensin II rabbit aorta AT1 receptor using radioligand [125I]-Sar Ile-AII
J Med Chem 37: 2808-24 (1994)
BindingDB Entry DOI: 10.7270/Q2M907QM