BDBM50040171 9-Methoxy-2-methyl-3-propyl-2,3,3a,4,5,9b-hexahydro-1H-benzo[e]indole::CHEMBL273614
SMILES: CCCN1[C@@H](C)CC2[C@H]1CCc1cccc(OC)c21
InChI Key: InChIKey=FWQJZNALGBTYNB-XSDATEAUSA-N
Data: 1 KI  1 IC50
Activity Spreadsheet -- Enzyme Inhibition Constant Data from BindingDB
Found 2 hits for monomerid = 50040171
Trg + Lig
Ki
nM
ΔG°
kcal/mole
IC50
nM
Kd
nM
EC50/IC50
nM
koff
s-1
kon
M-1s-1
pHTemp
°C
5-hydroxytryptamine receptor 1A
(Homo sapiens (Human))
BDBM50040171
(9-Methoxy-2-methyl-3-propyl-2,3,3a,4,5,9b-hexahydr...)
Show SMILES CCCN1[C@@H](C)CC2[C@H]1CCc1cccc(OC)c21
Show InChI InChI=1S/C17H25NO/c1-4-10-18-12(2)11-14-15(18)9-8-13-6-5-7-16(19-3)17(13)14/h5-7,12,14-15H,4,8-11H2,1-3H3/t12-,14?,15+/m0/s1
1n/an/an/an/an/an/an/an/a
Upjohn Laboratories
Curated by ChEMBL
Assay Description
Binding affinity against [3H]-8-OH-DPAT-labeled 5-hydroxytryptamine 1A receptor sites in bovine hippocampus
J Med Chem 36: 1053-68 (1993)
BindingDB Entry DOI: 10.7270/Q29S1Q3R
D(2) dopamine receptor
(Rattus norvegicus (rat))
BDBM50040171
(9-Methoxy-2-methyl-3-propyl-2,3,3a,4,5,9b-hexahydr...)
Show SMILES CCCN1[C@@H](C)CC2[C@H]1CCc1cccc(OC)c21
Show InChI InChI=1S/C17H25NO/c1-4-10-18-12(2)11-14-15(18)9-8-13-6-5-7-16(19-3)17(13)14/h5-7,12,14-15H,4,8-11H2,1-3H3/t12-,14?,15+/m0/s1
Reactome pathway
n/an/a>1.00E+3n/an/an/an/an/an/a
Upjohn Laboratories
Curated by ChEMBL
Assay Description
Inhibitory concentration against [3H]-raclopride-labeled dopamine receptor D2 in rat striatum
J Med Chem 36: 1053-68 (1993)
BindingDB Entry DOI: 10.7270/Q29S1Q3R