BDBM50040301 4-OHPhCH2CH2(CO)His-Trp-Ala-Val-DAla-His-DPro(psi)Phe-NH2::CHEMBL438190
SMILES: CC(C)[C@H](NC(=O)[C@H](C)NC(=O)[C@H](Cc1c[nH]c2ccccc12)NC(=O)[C@H](Cc1cnc[nH]1)NC(=O)CCc1ccc(O)cc1)C(=O)N[C@H](C)C(=O)N[C@@H](Cc1cnc[nH]1)C(=O)N1CCC[C@@H]1CN[C@@H](Cc1ccccc1)C(N)=O
InChI Key: InChIKey=WPFASEWGOGSMSX-QRZYSCAJSA-N
Data: 2 IC50
Activity Spreadsheet -- Enzyme Inhibition Constant Data from BindingDB
Found 2 hits for monomerid = 50040301
Trg + Lig
Ki
nM
ΔG°
kcal/mole
IC50
nM
Kd
nM
EC50/IC50
nM
koff
s-1
kon
M-1s-1
pHTemp
°C
Gastrin releasing peptide receptor
(MOUSE)
BDBM50040301
(4-OHPhCH2CH2(CO)His-Trp-Ala-Val-DAla-His-DPro(psi)...)
Show SMILES CC(C)[C@H](NC(=O)[C@H](C)NC(=O)[C@H](Cc1c[nH]c2ccccc12)NC(=O)[C@H](Cc1cnc[nH]1)NC(=O)CCc1ccc(O)cc1)C(=O)N[C@H](C)C(=O)N[C@@H](Cc1cnc[nH]1)C(=O)N1CCC[C@@H]1CN[C@@H](Cc1ccccc1)C(N)=O
Show InChI InChI=1S/C57H72N14O9/c1-33(2)50(56(79)66-34(3)52(75)69-48(26-40-29-60-32-64-40)57(80)71-22-10-13-41(71)30-62-45(51(58)74)23-37-11-6-5-7-12-37)70-53(76)35(4)65-54(77)46(24-38-27-61-44-15-9-8-14-43(38)44)68-55(78)47(25-39-28-59-31-63-39)67-49(73)21-18-36-16-19-42(72)20-17-36/h5-9,11-12,14-17,19-20,27-29,31-35,41,45-48,50,61-62,72H,10,13,18,21-26,30H2,1-4H3,(H2,58,74)(H,59,63)(H,60,64)(H,65,77)(H,66,79)(H,67,73)(H,68,78)(H,69,75)(H,70,76)/t34-,35+,41-,45+,46+,47+,48+,50+/m1/s1
Reactome pathway
n/an/a 0.0500n/an/an/an/an/an/a
Burroughs Wellcome Company
Curated by ChEMBL
Assay Description
The ability of the peptide to inhibit the binding of 50 pM [125I]-Gastrin releasing peptide to intact S-3T3 cells
J Med Chem 37: 439-45 (1994)
BindingDB Entry DOI: 10.7270/Q2ST7NXN
Gastrin releasing peptide receptor
(MOUSE)
BDBM50040301
(4-OHPhCH2CH2(CO)His-Trp-Ala-Val-DAla-His-DPro(psi)...)
Show SMILES CC(C)[C@H](NC(=O)[C@H](C)NC(=O)[C@H](Cc1c[nH]c2ccccc12)NC(=O)[C@H](Cc1cnc[nH]1)NC(=O)CCc1ccc(O)cc1)C(=O)N[C@H](C)C(=O)N[C@@H](Cc1cnc[nH]1)C(=O)N1CCC[C@@H]1CN[C@@H](Cc1ccccc1)C(N)=O
Show InChI InChI=1S/C57H72N14O9/c1-33(2)50(56(79)66-34(3)52(75)69-48(26-40-29-60-32-64-40)57(80)71-22-10-13-41(71)30-62-45(51(58)74)23-37-11-6-5-7-12-37)70-53(76)35(4)65-54(77)46(24-38-27-61-44-15-9-8-14-43(38)44)68-55(78)47(25-39-28-59-31-63-39)67-49(73)21-18-36-16-19-42(72)20-17-36/h5-9,11-12,14-17,19-20,27-29,31-35,41,45-48,50,61-62,72H,10,13,18,21-26,30H2,1-4H3,(H2,58,74)(H,59,63)(H,60,64)(H,65,77)(H,66,79)(H,67,73)(H,68,78)(H,69,75)(H,70,76)/t34-,35+,41-,45+,46+,47+,48+,50+/m1/s1
Reactome pathway
n/an/a 0.230n/an/an/an/an/an/a
Burroughs Wellcome Company
Curated by ChEMBL
Assay Description
Ability of peptide to inhibit binding of 10 pM [125I]-gastrin releasing peptide to S-3T3 cell membrane.
J Med Chem 37: 439-45 (1994)
BindingDB Entry DOI: 10.7270/Q2ST7NXN