BDBM50040678 1-((S)-1-Methyl-2-oxo-5-phenyl-2,3-dihydro-1H-benzo[e][1,4]diazepin-3-yl)-3-[4-(5-oxo-4,5-dihydro-[1,2,4]oxadiazol-3-yl)-phenyl]-urea::CHEMBL351891
SMILES: CN1c2ccccc2C(=N[C@H](NC(=O)Nc2ccc(cc2)-c2nc(=O)o[nH]2)C1=O)c1ccccc1
InChI Key: InChIKey=BNQCFNRZSLYOSO-JOCHJYFZSA-N
Data: 2 IC50
Activity Spreadsheet -- Enzyme Inhibition Constant Data from BindingDB
Found 2 hits for monomerid = 50040678
Trg + Lig
Ki
nM
ΔG°
kcal/mole
IC50
nM
Kd
nM
EC50/IC50
nM
koff
s-1
kon
M-1s-1
pHTemp
°C
Cholecystokinin receptor
(Homo sapiens (Human))
BDBM50040678
(1-((S)-1-Methyl-2-oxo-5-phenyl-2,3-dihydro-1H-benz...)
Show SMILES CN1c2ccccc2C(=N[C@H](NC(=O)Nc2ccc(cc2)-c2nc(=O)o[nH]2)C1=O)c1ccccc1 |c:9|
Show InChI InChI=1S/C25H20N6O4/c1-31-19-10-6-5-9-18(19)20(15-7-3-2-4-8-15)27-22(23(31)32)28-24(33)26-17-13-11-16(12-14-17)21-29-25(34)35-30-21/h2-14,22H,1H3,(H2,26,28,33)(H,29,30,34)/t22-/m1/s1
Reactome pathway
n/an/a 0.266n/an/an/an/an/an/a
Merck Research Laboratories
Curated by ChEMBL
Assay Description
The compound was tested for binding activity against Cholecystokinin type B receptor from rat pancreatic tissue using [125]BH CCK-8 as radioligand
J Med Chem 37: 722-4 (1994)
BindingDB Entry DOI: 10.7270/Q2CN72ZM
Cholecystokinin receptor
(RAT)
BDBM50040678
(1-((S)-1-Methyl-2-oxo-5-phenyl-2,3-dihydro-1H-benz...)
Show SMILES CN1c2ccccc2C(=N[C@H](NC(=O)Nc2ccc(cc2)-c2nc(=O)o[nH]2)C1=O)c1ccccc1 |c:9|
Show InChI InChI=1S/C25H20N6O4/c1-31-19-10-6-5-9-18(19)20(15-7-3-2-4-8-15)27-22(23(31)32)28-24(33)26-17-13-11-16(12-14-17)21-29-25(34)35-30-21/h2-14,22H,1H3,(H2,26,28,33)(H,29,30,34)/t22-/m1/s1
Reactome pathway
n/an/a 983n/an/an/an/an/an/a
Merck Research Laboratories
Curated by ChEMBL
Assay Description
The compound was tested for binding activity against Cholecystokinin type A receptor from rat pancreas using [125]BH CCK-8s as radioligand.
J Med Chem 37: 722-4 (1994)
BindingDB Entry DOI: 10.7270/Q2CN72ZM