BDBM50040867 CHEMBL3353206::US9586948, Example 25
SMILES: Cn1cc(cn1)-c1cccc(n1)C(=O)Nc1cn(C)nc1C(N)=O
InChI Key: InChIKey=XTVOMCVEGADMQN-UHFFFAOYSA-N
Data: 8 IC50
PDB links: 1 PDB ID matches this monomer.
Activity Spreadsheet -- Enzyme Inhibition Constant Data from BindingDB
Found 8 hits for monomerid = 50040867
Trg + Lig
Ki
nM
ΔG°
kcal/mole
IC50
nM
Kd
nM
EC50/IC50
nM
koff
s-1
kon
M-1s-1
pHTemp
°C
Interleukin-1 receptor-associated kinase 4
(Homo sapiens (Human))
BDBM50040867
(CHEMBL3353206 | US9586948, Example 25)
Show SMILES Cn1cc(cn1)-c1cccc(n1)C(=O)Nc1cn(C)nc1C(N)=O
Show InChI InChI=1S/C15H15N7O2/c1-21-7-9(6-17-21)10-4-3-5-11(18-10)15(24)19-12-8-22(2)20-13(12)14(16)23/h3-8H,1-2H3,(H2,16,23)(H,19,24)
Reactome pathway
n/an/a 32n/an/an/an/an/an/a
Nimbus Discovery
Curated by ChEMBL
Assay Description
Inhibition of IRAK4 (unknown origin)
J Med Chem 58: 96-110 (2015)
Article DOI: 10.1021/jm5016044
BindingDB Entry DOI: 10.7270/Q2P84DHS
3D
3D Structure (crystal)
Interleukin-1 receptor-associated kinase 4
(Homo sapiens (Human))
BDBM50040867
(CHEMBL3353206 | US9586948, Example 25)
Show SMILES Cn1cc(cn1)-c1cccc(n1)C(=O)Nc1cn(C)nc1C(N)=O
Show InChI InChI=1S/C15H15N7O2/c1-21-7-9(6-17-21)10-4-3-5-11(18-10)15(24)19-12-8-22(2)20-13(12)14(16)23/h3-8H,1-2H3,(H2,16,23)(H,19,24)
Reactome pathway
US Patent
n/an/a 32n/an/an/an/a7.2n/a
MERCK SHARP & DOHME CORP.
US Patent
Assay Description
The kinase activity of IRAK4 is determined by its ability to catalyze the phosphorylation of a fluorescent polypeptide substrate. The extent of phosp...
US Patent US9586948 (2017)
BindingDB Entry DOI: 10.7270/Q2RF5X2W
3D
3D Structure (crystal)
Interleukin-1 receptor-associated kinase 4
(Homo sapiens (Human))
BDBM50040867
(CHEMBL3353206 | US9586948, Example 25)
Show SMILES Cn1cc(cn1)-c1cccc(n1)C(=O)Nc1cn(C)nc1C(N)=O
Show InChI InChI=1S/C15H15N7O2/c1-21-7-9(6-17-21)10-4-3-5-11(18-10)15(24)19-12-8-22(2)20-13(12)14(16)23/h3-8H,1-2H3,(H2,16,23)(H,19,24)
Reactome pathway
n/an/a 36n/an/an/an/an/an/a
Merck Research Laboratories
Curated by ChEMBL
Assay Description
Inhibition of human recombinant N-terminal GST-tagged full-length IRAK4 expressed in baculovirus infected Sf9 insect cells using 5FAM-RKRQGSVRRRVH-CO...
Bioorg Med Chem Lett 26: 4250-5 (2016)
Article DOI: 10.1016/j.bmcl.2016.07.048
3D
3D Structure (crystal)
Interleukin-1 receptor-associated kinase 4
(Homo sapiens (Human))
BDBM50040867
(CHEMBL3353206 | US9586948, Example 25)
Show SMILES Cn1cc(cn1)-c1cccc(n1)C(=O)Nc1cn(C)nc1C(N)=O
Show InChI InChI=1S/C15H15N7O2/c1-21-7-9(6-17-21)10-4-3-5-11(18-10)15(24)19-12-8-22(2)20-13(12)14(16)23/h3-8H,1-2H3,(H2,16,23)(H,19,24)
Reactome pathway
n/an/a 36n/an/an/an/an/an/a
Merck Research Laboratories
Curated by ChEMBL
Assay Description
Inhibition of human recombinant N-terminal GST-tagged full-length IRAK4 expressed in baculovirus infected Sf9 insect cells using 5FAM-RKRQGSVRRRVH-CO...
Bioorg Med Chem Lett 26: 4250-5 (2016)
Article DOI: 10.1016/j.bmcl.2016.07.048
3D
3D Structure (crystal)
Interleukin-1 receptor-associated kinase 4
(Homo sapiens (Human))
BDBM50040867
(CHEMBL3353206 | US9586948, Example 25)
Show SMILES Cn1cc(cn1)-c1cccc(n1)C(=O)Nc1cn(C)nc1C(N)=O
Show InChI InChI=1S/C15H15N7O2/c1-21-7-9(6-17-21)10-4-3-5-11(18-10)15(24)19-12-8-22(2)20-13(12)14(16)23/h3-8H,1-2H3,(H2,16,23)(H,19,24)
Reactome pathway
n/an/a 138n/an/an/an/an/an/a
Merck Research Laboratories
Curated by ChEMBL
Assay Description
Inhibition of recombinant N-terminal GST-tagged full-length IRAK4 in human THP1-XBlue cells assessed as decrease in NF-kappaB level preincubated for ...
Bioorg Med Chem Lett 26: 4250-5 (2016)
Article DOI: 10.1016/j.bmcl.2016.07.048
3D
3D Structure (crystal)
1,3-beta-glucan synthase component GLS2
(Saccharomyces cerevisiae)
BDBM50040867
(CHEMBL3353206 | US9586948, Example 25)
Show SMILES Cn1cc(cn1)-c1cccc(n1)C(=O)Nc1cn(C)nc1C(N)=O
Show InChI InChI=1S/C15H15N7O2/c1-21-7-9(6-17-21)10-4-3-5-11(18-10)15(24)19-12-8-22(2)20-13(12)14(16)23/h3-8H,1-2H3,(H2,16,23)(H,19,24)
n/an/a>6.00E+4n/an/an/an/an/an/a
Merck Research Laboratories
Curated by ChEMBL
Assay Description
Inhibition of MK499 binding to human ERG
Bioorg Med Chem Lett 26: 4250-5 (2016)
Article DOI: 10.1016/j.bmcl.2016.07.048
Interleukin-1 receptor-associated kinase 4
(Homo sapiens (Human))
BDBM50040867
(CHEMBL3353206 | US9586948, Example 25)
Show SMILES Cn1cc(cn1)-c1cccc(n1)C(=O)Nc1cn(C)nc1C(N)=O
Show InChI InChI=1S/C15H15N7O2/c1-21-7-9(6-17-21)10-4-3-5-11(18-10)15(24)19-12-8-22(2)20-13(12)14(16)23/h3-8H,1-2H3,(H2,16,23)(H,19,24)
Reactome pathway
n/an/a 138n/an/an/an/an/an/a
Merck Research Laboratories
Curated by ChEMBL
Assay Description
Inhibition of recombinant N-terminal GST-tagged full-length IRAK4 in human THP1-XBlue cells assessed as decrease in NF-kappaB level preincubated for ...
Bioorg Med Chem Lett 26: 4250-5 (2016)
Article DOI: 10.1016/j.bmcl.2016.07.048
3D
3D Structure (crystal)
1,3-beta-glucan synthase component GLS2
(Saccharomyces cerevisiae)
BDBM50040867
(CHEMBL3353206 | US9586948, Example 25)
Show SMILES Cn1cc(cn1)-c1cccc(n1)C(=O)Nc1cn(C)nc1C(N)=O
Show InChI InChI=1S/C15H15N7O2/c1-21-7-9(6-17-21)10-4-3-5-11(18-10)15(24)19-12-8-22(2)20-13(12)14(16)23/h3-8H,1-2H3,(H2,16,23)(H,19,24)
n/an/a>6.00E+4n/an/an/an/an/an/a
Merck Research Laboratories
Curated by ChEMBL
Assay Description
Inhibition of MK499 binding to human ERG
Bioorg Med Chem Lett 26: 4250-5 (2016)
Article DOI: 10.1016/j.bmcl.2016.07.048