null
SMILES: N[C@H]1CCCC[C@H]1Nc1cccc2nc(sc12)-c1c(N[C@@H]2CCCNC2)nc([nH]c1=O)N1CCOCC1
InChI Key:
Activity Spreadsheet -- Enzyme Inhibition Constant Data from BindingDB
Found 1 hit for monomerid = 50040868
Trg + Lig
Ki
nM
ΔG°
kcal/mole
IC50
nM
Kd
nM
EC50/IC50
nM
koff
s-1
kon
M-1s-1
pHTemp
°C
Interleukin-1 receptor-associated kinase 4
(Homo sapiens (Human))
BDBM50040868
(CHEMBL3353205)
Show SMILES N[C@H]1CCCC[C@H]1Nc1cccc2nc(sc12)-c1c(N[C@@H]2CCCNC2)nc([nH]c1=O)N1CCOCC1 |r|
Reactome pathway
n/an/a 2n/an/an/an/an/an/a
Nimbus Discovery
Curated by ChEMBL
Assay Description
Inhibition of IRAK4 (unknown origin)
J Med Chem 58: 96-110 (2015)
Article DOI: 10.1021/jm5016044
BindingDB Entry DOI: 10.7270/Q2P84DHS