null
SMILES: Cl.Cn1cc(NC(=O)c2coc(n2)-c2ccnc(NCC(F)(F)F)c2)c(n1)C(N)=O
InChI Key: InChIKey=YTPWJNMXPRLWQF-UHFFFAOYSA-N
Activity Spreadsheet -- Enzyme Inhibition Constant Data from BindingDB
Found 1 hit for monomerid = 50040872
Trg + Lig
Ki
nM
ΔG°
kcal/mole
IC50
nM
Kd
nM
EC50/IC50
nM
koff
s-1
kon
M-1s-1
pHTemp
°C
Interleukin-1 receptor-associated kinase 4
(Homo sapiens (Human))
BDBM50040872
(CHEMBL3353189)
Show SMILES Cl.Cn1cc(NC(=O)c2coc(n2)-c2ccnc(NCC(F)(F)F)c2)c(n1)C(N)=O
Show InChI InChI=1S/C16H14F3N7O3/c1-26-5-9(12(25-26)13(20)27)23-14(28)10-6-29-15(24-10)8-2-3-21-11(4-8)22-7-16(17,18)19/h2-6H,7H2,1H3,(H2,20,27)(H,21,22)(H,23,28)
Reactome pathway
n/an/a 0.240n/an/an/an/an/an/a
Nimbus Discovery
Curated by ChEMBL
Assay Description
Inhibition of IRAK4 (unknown origin)
J Med Chem 58: 96-110 (2015)
Article DOI: 10.1021/jm5016044
BindingDB Entry DOI: 10.7270/Q2P84DHS