BDBM50040884 CHEMBL3353805
SMILES: N#Cc1cccc(CSc2nnc3c(n2)[nH]c2ccccc32)c1
InChI Key: InChIKey=ZHTPBXDDWZAVCE-UHFFFAOYSA-N
Data: 2 EC50
Activity Spreadsheet -- Enzyme Inhibition Constant Data from BindingDB
Found 2 hits for monomerid = 50040884
Trg + Lig
Ki
nM
ΔG°
kcal/mole
IC50
nM
Kd
nM
EC50/IC50
nM
koff
s-1
kon
M-1s-1
pHTemp
°C
Cannabinoid receptor 1
(Homo sapiens (Human))
BDBM50040884
(CHEMBL3353805)
Show SMILES N#Cc1cccc(CSc2nnc3c(n2)[nH]c2ccccc32)c1
Show InChI InChI=1S/C17H11N5S/c18-9-11-4-3-5-12(8-11)10-23-17-20-16-15(21-22-17)13-6-1-2-7-14(13)19-16/h1-8H,10H2,(H,19,20,22)
NCI pathway
Reactome pathway
n/an/an/an/a>3.00E+4n/an/an/an/a
University of Oxford
Curated by ChEMBL
Assay Description
Agonist activity at human CB1R expressed in CHO cells assessed as reduction in forskolin-induced cAMP accumulation by beta-galactosidase based comple...
Bioorg Med Chem 23: 241-63 (2014)
Article DOI: 10.1016/j.bmc.2014.11.002
BindingDB Entry DOI: 10.7270/Q2930VS3
Cannabinoid receptor 2
(Homo sapiens (Human))
BDBM50040884
(CHEMBL3353805)
Show SMILES N#Cc1cccc(CSc2nnc3c(n2)[nH]c2ccccc32)c1
Show InChI InChI=1S/C17H11N5S/c18-9-11-4-3-5-12(8-11)10-23-17-20-16-15(21-22-17)13-6-1-2-7-14(13)19-16/h1-8H,10H2,(H,19,20,22)
Reactome pathway
n/an/an/an/a 6.45E+3n/an/an/an/a
University of Oxford
Curated by ChEMBL
Assay Description
Agonist activity at human CB2R expressed in CHO cells assessed as reduction in forskolin-induced cAMP accumulation by beta-galactosidase based comple...
Bioorg Med Chem 23: 241-63 (2014)
Article DOI: 10.1016/j.bmc.2014.11.002
BindingDB Entry DOI: 10.7270/Q2930VS3