BDBM50040888 CHEMBL3353809
SMILES: Clc1ccccc1CSc1nnc2c(n1)[nH]c1ccccc21
InChI Key: InChIKey=BUWZNQAPWHNMKF-UHFFFAOYSA-N
Data: 1 EC50
Activity Spreadsheet -- Enzyme Inhibition Constant Data from BindingDB
Found 1 hit for monomerid = 50040888
Trg + Lig
Ki
nM
ΔG°
kcal/mole
IC50
nM
Kd
nM
EC50/IC50
nM
koff
s-1
kon
M-1s-1
pHTemp
°C
Cannabinoid receptor 2
(Homo sapiens (Human))
BDBM50040888
(CHEMBL3353809)
Show SMILES Clc1ccccc1CSc1nnc2c(n1)[nH]c1ccccc21
Show InChI InChI=1S/C16H11ClN4S/c17-12-7-3-1-5-10(12)9-22-16-19-15-14(20-21-16)11-6-2-4-8-13(11)18-15/h1-8H,9H2,(H,18,19,21)
Reactome pathway
n/an/an/an/a>3.00E+3n/an/an/an/a
University of Oxford
Curated by ChEMBL
Assay Description
Agonist activity at human CB2R expressed in CHO cells assessed as reduction in forskolin-induced cAMP accumulation by beta-galactosidase based comple...
Bioorg Med Chem 23: 241-63 (2014)
Article DOI: 10.1016/j.bmc.2014.11.002
BindingDB Entry DOI: 10.7270/Q2930VS3