BDBM50040924 5,6-Bis-phenylsulfanyl-isoindole-1,3-dione::CHEMBL8271
SMILES: O=C1NC(=O)c2cc(Sc3ccccc3)c(Sc3ccccc3)cc12
InChI Key: InChIKey=HEUOZLPVHVQHOK-UHFFFAOYSA-N
Data: 2 IC50
Activity Spreadsheet -- Enzyme Inhibition Constant Data from BindingDB
Found 2 hits for monomerid = 50040924
Trg + Lig
Ki
nM
ΔG°
kcal/mole
IC50
nM
Kd
nM
EC50/IC50
nM
koff
s-1
kon
M-1s-1
pHTemp
°C
Epidermal growth factor receptor
(Homo sapiens (Human))
BDBM50040924
(5,6-Bis-phenylsulfanyl-isoindole-1,3-dione | CHEMB...)
Show SMILES O=C1NC(=O)c2cc(Sc3ccccc3)c(Sc3ccccc3)cc12
Show InChI InChI=1S/C20H13NO2S2/c22-19-15-11-17(24-13-7-3-1-4-8-13)18(12-16(15)20(23)21-19)25-14-9-5-2-6-10-14/h1-12H,(H,21,22,23)
n/an/a>1.00E+5n/an/an/an/an/an/a
Ciba-Geigy Limited
Curated by ChEMBL
Assay Description
Inhibitory activity against recombinant tyrosine kinase EGF-R (EGF-R ICD)
J Med Chem 37: 1015-27 (1994)
BindingDB Entry DOI: 10.7270/Q2M32TTP
Cyclic AMP-dependent protein kinase (PKA)
(Oryctolagus cuniculus (Rabbit))
BDBM50040924
(5,6-Bis-phenylsulfanyl-isoindole-1,3-dione | CHEMB...)
Show SMILES O=C1NC(=O)c2cc(Sc3ccccc3)c(Sc3ccccc3)cc12
Show InChI InChI=1S/C20H13NO2S2/c22-19-15-11-17(24-13-7-3-1-4-8-13)18(12-16(15)20(23)21-19)25-14-9-5-2-6-10-14/h1-12H,(H,21,22,23)
n/an/a>5.00E+5n/an/an/an/an/an/a
Ciba-Geigy Limited
Curated by ChEMBL
Assay Description
Inhibitory activity was determined against protein kinase A (PKA) of rabbit
J Med Chem 37: 1015-27 (1994)
BindingDB Entry DOI: 10.7270/Q2M32TTP